program: Gaussian 09
title: 000260185
version: EM64L-G09RevD.01
frameworkgroup: C1[X(C14H14ClNO2)]
method: RPBEPBE
basis: SDD
operation: Freq
keyword: #p
keyword: freq=noraman
keyword: PBEPBE/SDD
title: #p freq=noraman PBEPBE/SDD
converged: YES YES NO NO
title: Mulliken charges:
elementType: Cl O O N C C C C C C C C C C C C C C H H H H H H H H H H H H H H
charge: -0.020156 -0.200149 -0.200674 -0.401757 -0.425105 -0.308181 -0.341013 0.585820 0.341013 0.291515 -0.138358 -0.623936 0.007837 -0.686945 -0.377095 -0.373920 -0.232366 -0.222016 0.206619 0.207836 0.237602 0.238846 0.201161 0.201187 0.320444 0.211292 0.221836 0.211366 0.289129 0.296518 0.240487 0.241165
chargesum: 0.00000
title: Mulliken charges with hydrogens summed into heavy atoms:
elementType: Cl O O N C C C C C C C C C C C C C C
charge: -0.020156 -0.200149 -0.200674 -0.081314 -0.010650 0.168266 0.061335 0.585820 0.341013 0.291515 -0.138358 -0.623936 0.007837 -0.042451 -0.087966 -0.077403 0.008121 0.019150
polarizability: 2.82229838e+02 -2.37499305e+00 2.09290255e+02 -4.15099064e-01 1.61684808e-01 8.35433453e+01
1716.lowfreq: -24.2340 -5.7275 -5.4149 -0.0017 0.0016 0.0021 15.3518 24.1526 57.2513
frequency: 6.2946 16.7331 57.2261 63.1702 73.3773 116.3861 131.5151 141.7207 176.7959 178.1103 190.2174 238.7994 243.8610 275.5029 285.2745 324.0898 360.6504 370.9204 415.7081 432.4625 432.9848 469.7881 502.0993 517.7222 578.6352 639.0584 655.1261 680.7931 702.3493 728.7097 731.7559 790.7865 797.2318 803.1844 847.6870 855.4337 898.0970 931.0247 934.3709 966.7686 994.8037 1013.1697 1022.6259 1033.7503 1073.8408 1077.7240 1084.0993 1118.9078 1144.2629 1159.1568 1172.2027 1217.4827 1234.9446 1259.3925 1270.2281 1274.5703 1288.5722 1297.0512 1327.6051 1353.7179 1389.5617 1393.2736 1400.1689 1437.6902 1455.7331 1464.3886 1469.4425 1471.0601 1479.9746 1480.2201 1487.9490 1524.3821 1547.1631 1577.5142 1602.2146 1610.4396 2959.2456 2974.7338 2976.8356 2999.5770 3003.5592 3029.5547 3057.8002 3074.0323 3078.4108 3137.6832 3152.8331 3163.8011 3173.0487 3462.4167
redmass: 1.6037 4.8944 4.5364 7.0225 4.9802 2.7697 3.4950 3.5558 4.8219 4.2602 6.5671 1.0985 5.5474 6.6156 9.7566 8.1592 4.2787 10.5606 3.9377 6.6171 4.0430 5.3186 6.1709 3.1169 7.2130 1.5077 6.5586 4.3367 7.4282 2.0729 1.2544 1.1501 8.8436 1.7250 7.8922 3.0310 1.9613 1.1966 1.7525 5.1670 1.3945 1.3613 3.3273 2.6049 2.8726 2.6513 2.5010 2.4237 1.5426 2.6580 1.1073 1.3186 2.1905 1.7699 1.8282 1.1401 1.0734 2.9604 1.3733 1.6127 7.9086 1.2182 9.6637 2.3651 1.5572 1.0713 1.1436 2.2489 1.0694 1.0420 1.0841 10.7424 10.5592 5.0630 6.6056 6.4118 1.0584 1.0587 1.0366 1.0592 1.0996 1.1033 1.1049 1.1011 1.0993 1.0863 1.0903 1.0946 1.1002 1.0752
irintensity: 0.1921 0.1688 0.1368 6.3015 0.4362 1.2079 0.4064 0.0026 0.4203 1.1329 0.5339 0.0168 0.4510 0.0004 0.9390 3.4154 1.9515 16.7171 1.7826 4.8758 0.3305 4.6459 3.0920 2.4764 12.9777 87.4705 6.1535 23.7619 1.2636 12.0005 26.0932 0.7516 85.2207 39.9572 0.0239 3.7202 4.7006 0.4285 0.0204 48.1742 4.0749 0.2133 2.9023 2.6013 9.2463 0.7521 0.3386 59.0612 0.7001 25.3389 7.4925 0.0506 83.8197 86.3980 98.6207 0.3091 0.3439 36.8719 27.1065 20.5231 166.2212 6.7882 1.8769 11.4615 6.0185 10.2766 0.8852 0.7888 15.6221 13.5773 15.2752 91.4591 494.5123 188.2515 61.2238 77.1103 8.6213 46.0027 35.4967 17.4077 1.0556 13.1882 26.7100 88.0914 46.9733 4.6280 6.2858 1.3002 26.4116 62.1380
temp: 298.150 k
press: 1.00000 atm
elementType: 17 8 8 7 6 6 6 6 6 6 6 6 6 6 6 6 6 6 1 1 1 1 1 1 1 1 1 1 1 1 1 1
symmnumber: 1
zpe: 652055.9 jmol-1
zpe.correction: 0.248355 hartree
zpe.thermalcorrener: 0.265683 hartree
zpe.thermalcorrenthalpy: 0.266628 hartree
zpe.thermalcorrgfe: 0.199520 hartree
zpe.sumelectzpe: -1205.853579 hartree
zpe.sumelectthermal: -1205.836251 hartree
zpe.sumelectthermalent: -1205.835306 hartree
zpe.sumelectthermalfe: -1205.902414 hartree
dipole: 2.4533 -3.5242 0.0093
dipole: 4.2940
quadrupole: -90.4893 -123.3620 -114.0619
quadrupole: 14.5172 -0.0036 -0.0543
quadrupole: 18.8151 -14.0576 -4.7575 14.5172 -0.0036 -0.0543
hfenergy: -1206.101934 hartree
pointgroup: C01 [X(C14H14Cl1N1O2)]
dipole: -0.9429065 -1.3653 0.3177645 debye
polarizability: 282.1275157|3.153822|202.8600623|-2.0676253|-27.9017648|90.07586 unknown
InChI: InChI=1S/C14H14ClNO2/c1-2-3-8-16-12-11(15)13(17)9-6-4-5-7-10(9)14(12)18/h4-7,16H,2-3,8H2,1H3
charge 0 multiplicity 1
32 atoms
Cl -0.586526 3.174017 -0.708267
O  -0.457498 -1.882627 0.476032
O  2.404036 2.708021 -0.62519
N  -1.867614 0.524853 -0.080106
C  -4.281299 0.034057 0.040662
C  -2.85922 -0.547161 0.166601
C  -5.364718 -1.043103 0.274283
C  -0.497839 0.47281 -0.077406
C  1.696885 -0.833215 0.212055
C  2.432002 0.350186 -0.072077
C  0.208856 -0.830254 0.223121
C  0.280357 1.606743 -0.347825
C  1.734349 1.651643 -0.370688
C  -6.796559 -0.479234 0.15581
C  2.382477 -2.042379 0.490053
C  3.843949 0.314337 -0.076524
C  3.791613 -2.072761 0.484539
C  4.522753 -0.892525 0.200568
H  -4.416983 0.475588 -0.968387
H  -4.416125 0.854358 0.775662
H  -2.712072 -1.372284 -0.554216
H  -2.705483 -0.982536 1.170749
H  -5.223581 -1.4918 1.278024
H  -5.227128 -1.86423 -0.45753
H  -2.256457 1.450933 -0.293943
H  -6.974442 -0.052511 -0.84909
H  -7.552351 -1.266941 0.326293
H  -6.971486 0.322465 0.897517
H  1.792556 -2.938694 0.705637
H  4.381461 1.241199 -0.298842
H  4.320712 -3.007013 0.699141
H  5.617768 -0.915742 0.195947
