program: Gaussian 09
title: 000260182
version: EM64L-G09RevD.01
frameworkgroup: C1[X(C13H12ClNO2)]
method: RPBEPBE
basis: SDD
operation: Freq
keyword: #p
keyword: freq=noraman
keyword: PBEPBE/SDD
title: #p freq=noraman PBEPBE/SDD
converged: YES YES NO NO
title: Mulliken charges:
elementType: Cl O O N C C C C C C C C C C C C C H H H H H H H H H H H H
charge: -0.019015 -0.211374 -0.199321 -0.399697 -0.037734 0.606239 0.336047 0.295294 -0.131728 -0.643046 -0.667058 -0.716683 0.003314 -0.375016 -0.373992 -0.232062 -0.222093 0.265676 0.309226 0.215844 0.204168 0.251555 0.236502 0.230058 0.206934 0.289169 0.296684 0.240670 0.241436
chargesum: 0.00000
title: Mulliken charges with hydrogens summed into heavy atoms:
elementType: Cl O O N C C C C C C C C C C C C C
charge: -0.019015 -0.211374 -0.199321 -0.090471 0.227942 0.606239 0.336047 0.295294 -0.131728 -0.643046 0.004510 -0.043188 0.003314 -0.085847 -0.077307 0.008608 0.019343
polarizability: 2.59489774e+02 -9.11699431e+00 2.02016238e+02 -2.06331274e+00 2.96019823e+00 7.90419912e+01
1716.lowfreq: -7.1236 -6.8149 -0.0030 -0.0023 -0.0015 5.0676 27.3520 54.4438 69.3787
frequency: 27.2600 54.4072 69.3686 98.1846 121.7248 129.7430 165.7777 197.3092 202.7556 239.5621 257.5606 271.9836 288.1409 313.0497 344.0809 371.6419 395.5915 415.5904 432.8261 441.9276 459.6695 507.1065 521.1021 576.9549 651.3167 661.9570 681.6310 700.2096 728.9503 795.6557 803.4464 809.7552 854.0746 874.3183 918.1329 923.5516 934.0532 944.2790 995.0595 1004.0626 1013.3076 1042.8320 1082.0489 1121.8270 1135.4889 1166.2871 1170.8464 1178.6685 1233.7075 1265.1408 1287.9414 1300.6221 1338.0917 1375.7495 1389.7426 1395.7564 1401.0520 1438.2146 1455.2273 1460.8697 1467.6222 1470.7651 1482.0069 1485.6653 1525.0013 1545.9172 1574.4145 1601.7231 1608.9161 2976.7212 2986.2397 3059.4046 3074.6828 3091.1734 3098.2562 3105.2620 3138.3051 3153.1682 3163.9175 3173.4153 3446.8459
redmass: 4.5950 3.5148 6.5188 4.4010 3.7836 5.1641 7.1329 8.0548 1.0348 1.1216 4.5776 6.3746 7.3920 4.1212 6.0795 8.2193 3.2013 3.8645 4.0105 2.8135 7.6102 5.9612 3.6265 5.5495 5.8622 1.5389 3.8891 7.4740 2.9088 8.9694 1.7108 4.0435 3.0891 3.5202 1.4259 2.1335 1.7886 1.4291 1.3935 3.9852 1.3608 1.9881 2.7773 2.1778 2.2439 1.9246 1.1388 2.3710 2.2994 2.4973 1.6166 2.6350 1.2644 1.2222 5.8652 1.2461 9.6161 2.3394 1.4259 1.0804 1.0522 2.4719 1.1488 1.0488 10.9072 10.3870 4.2677 6.7231 6.4489 1.0382 1.0361 1.0896 1.0976 1.0963 1.0985 1.0996 1.0863 1.0903 1.0946 1.1003 1.0748
irintensity: 2.4353 0.5932 2.6333 2.3269 0.6465 0.1281 0.3724 0.6726 0.0820 0.2427 0.1756 0.0308 0.7820 3.3362 1.1022 14.6523 5.8278 1.5296 0.0123 2.0120 7.5090 1.5520 1.4194 13.4997 5.5629 81.0514 41.9173 1.0690 23.5356 74.7660 40.3713 8.1531 3.5027 0.8763 1.2062 24.5316 0.0936 1.9961 4.0159 22.6501 0.1781 2.9650 0.7498 123.5609 32.7893 22.9209 23.6797 14.4012 106.0929 141.5075 13.9657 35.6224 23.3578 32.5637 141.8909 33.0051 2.4491 10.4631 1.5148 7.7684 6.6052 1.7524 12.0326 19.3485 91.4586 529.2865 195.3624 48.6159 41.5103 23.7575 33.4141 9.8599 6.3325 36.8205 35.8623 28.3537 4.6373 5.7507 1.2387 26.4997 49.9021
temp: 298.150 k
press: 1.00000 atm
elementType: 17 8 8 7 6 6 6 6 6 6 6 6 6 6 6 6 6 1 1 1 1 1 1 1 1 1 1 1 1
symmnumber: 1
zpe: 578194.8 jmol-1
zpe.correction: 0.220223 hartree
zpe.thermalcorrener: 0.235965 hartree
zpe.thermalcorrenthalpy: 0.236909 hartree
zpe.thermalcorrgfe: 0.176491 hartree
zpe.sumelectzpe: -1166.633597 hartree
zpe.sumelectthermal: -1166.617856 hartree
zpe.sumelectthermalent: -1166.616911 hartree
zpe.sumelectthermalfe: -1166.677329 hartree
dipole: 1.6488 -3.7379 -0.2071
dipole: 4.0906
quadrupole: -80.9349 -118.8926 -107.8588
quadrupole: 8.2207 -0.2787 -0.4762
quadrupole: 21.6272 -16.3305 -5.2967 8.2207 -0.2787 -0.4762
hfenergy: -1166.8538202 hartree
pointgroup: C01 [X(C13H12Cl1N1O2)]
dipole: -0.6469533 -1.42868 -0.3611533 debye
polarizability: 259.4081632|8.0410356|193.4765169|5.7484505|31.4594743|87.6633234 unknown
InChI: InChI=1S/C13H12ClNO2/c1-7(2)15-11-10(14)12(16)8-5-3-4-6-9(8)13(11)17/h3-7,15H,1-2H3
charge 0 multiplicity 1
29 atoms
Cl -1.461993 3.009529 0.747769
O  -0.729739 -1.989657 -0.495552
O  1.555746 2.882607 0.734005
N  -2.433282 0.246302 0.09453
C  -3.338101 -0.891234 -0.236694
C  -1.065032 0.338615 0.098392
C  1.274877 -0.705827 -0.142602
C  1.865529 0.548902 0.169403
C  -0.203488 -0.870804 -0.200533
C  -0.421139 1.549999 0.393688
C  -3.511079 -1.037379 -1.767454
C  -4.68455 -0.631135 0.469901
C  1.017155 1.759943 0.4547
C  2.09958 -1.827742 -0.409433
C  3.271516 0.672156 0.212839
C  3.502615 -1.700107 -0.364243
C  4.088976 -0.448352 -0.052686
H  -2.881483 -1.815028 0.150842
H  -2.910945 1.133212 0.299254
H  -4.187213 -1.882837 -1.989726
H  -3.94568 -0.119802 -2.205267
H  -2.541578 -1.241265 -2.250669
H  -4.557344 -0.554975 1.564387
H  -5.383196 -1.459243 0.261017
H  -5.155653 0.302142 0.103683
H  1.620465 -2.782408 -0.647786
H  3.695037 1.651501 0.45553
H  4.138749 -2.567164 -0.570086
H  5.179149 -0.348747 -0.018008
