program: Gaussian 09
title: 000260181
version: EM64L-G09RevD.01
frameworkgroup: C1[X(C17H20ClNO2)]
method: RPBEPBE
basis: SDD
operation: Freq
keyword: #p
keyword: freq=noraman
keyword: PBEPBE/SDD
title: #p freq=noraman PBEPBE/SDD
converged: NO YES NO NO
title: Mulliken charges:
elementType: Cl O O N C C C C C C C C C C C C C C C C C H H H H H H H H H H H H H H H H H H H H
charge: -0.020364 -0.199796 -0.200973 -0.403026 -0.366128 -0.366585 -0.458159 -0.353180 -0.322572 -0.355899 0.585707 -0.695096 0.342282 -0.138228 0.291121 -0.623856 0.007772 -0.377659 -0.373956 -0.232434 -0.222075 0.197633 0.198809 0.191230 0.189852 0.213946 0.211757 0.189575 0.188857 0.241046 0.242247 0.195752 0.195343 0.322163 0.210364 0.210259 0.217125 0.289150 0.296490 0.240413 0.241093
chargesum: 0.00000
title: Mulliken charges with hydrogens summed into heavy atoms:
elementType: Cl O O N C C C C C C C C C C C C C C C C C
charge: -0.020364 -0.199796 -0.200973 -0.080863 0.030314 0.014497 -0.032455 0.025253 0.160721 0.035195 0.585707 -0.057349 0.342282 -0.138228 0.291121 -0.623856 0.007772 -0.088509 -0.077466 0.007979 0.019018
polarizability: 3.34388973e+02 2.60224065e+00 2.36714700e+02 3.03400461e+00 -8.73297751e-01 1.09261021e+02
1716.lowfreq: -5.0339 -1.2243 -0.0012 0.0004 0.0008 8.2431 17.2781 29.6785 41.9918
frequency: 16.6535 29.5585 41.6747 47.4102 64.7043 88.1162 96.5530 97.3977 122.8815 132.6612 140.0839 145.8806 157.9793 179.5882 197.6899 219.6490 228.6236 275.1607 280.4052 304.9172 333.9231 361.0394 373.8804 415.7855 424.8602 433.8964 452.2854 483.3285 509.8055 518.8503 582.5160 642.5408 656.1796 681.0732 702.5014 723.8815 729.4016 734.4896 764.8258 797.5350 803.3043 828.2680 847.6439 856.0464 889.4677 916.7943 934.6342 959.2792 995.2593 997.9019 1002.7409 1013.4628 1023.7838 1040.2607 1053.3382 1076.1901 1078.9927 1081.3374 1086.3973 1122.1627 1147.6747 1156.8751 1172.0006 1193.5578 1227.8137 1235.5542 1236.7164 1264.4766 1270.9915 1276.0997 1284.6102 1296.6394 1296.7632 1299.4035 1314.2893 1342.5231 1357.1094 1363.2042 1389.4254 1391.4198 1399.8699 1438.1349 1458.5514 1463.2420 1464.4370 1467.3324 1469.7570 1472.4788 1477.6599 1479.2233 1485.7565 1489.7675 1523.9146 1546.7566 1577.8438 1602.1506 1609.9325 2953.1874 2956.4166 2959.0888 2966.5499 2971.1001 2973.4834 2988.8388 2998.9737 3000.8499 3009.5157 3025.9941 3040.8016 3060.0877 3069.8811 3072.5264 3137.7302 3152.7041 3163.6565 3173.0257 3462.0562
redmass: 5.2402 5.0510 2.9161 1.8855 9.5588 3.8945 2.7093 2.1334 3.5314 4.1093 1.8679 5.6611 3.0680 3.9129 4.0306 7.6326 1.1292 6.6526 8.3717 4.4220 6.8605 6.1338 8.8024 3.9596 3.7420 3.9553 6.4837 4.4908 5.0826 3.2013 6.8462 1.4864 6.4643 4.3233 7.4592 1.0625 2.7109 1.1116 1.1349 9.0353 1.7203 1.1978 7.9061 3.0292 1.8950 1.2085 1.8048 6.9431 1.3929 4.5762 1.1364 1.3603 3.0821 2.6702 3.1219 3.1910 2.4004 2.2739 2.4215 2.7054 1.4988 2.6659 1.0980 1.5768 1.3353 2.2340 1.3130 2.4379 1.1970 1.3804 1.0362 1.7654 1.4410 1.0855 1.3911 1.4337 1.6335 1.6276 8.2960 1.2176 9.7872 2.3980 1.5056 1.0769 1.1219 1.0716 2.3076 1.0945 1.0435 1.0777 1.0883 1.0965 10.6727 10.5090 4.9196 6.5905 6.2739 1.0590 1.0589 1.0589 1.0592 1.0588 1.0364 1.0973 1.0996 1.0590 1.1024 1.1044 1.1048 1.1050 1.1007 1.0993 1.0863 1.0903 1.0946 1.1002 1.0752
irintensity: 0.0067 0.1279 1.6501 0.4865 3.5300 1.2735 0.3408 0.8074 0.2106 0.1153 0.3621 0.4993 0.0012 0.5013 1.0543 0.6496 0.0027 0.0021 0.3993 1.9822 0.8336 0.4350 21.5312 1.6467 3.1473 0.0186 4.4258 1.2361 3.6440 2.0429 12.3188 85.6827 5.6082 24.3439 1.4764 14.4774 27.6631 1.4602 2.1402 85.2045 39.1638 1.3274 0.0202 3.6528 4.5462 0.1842 0.0953 35.0337 4.0637 0.7053 0.6597 0.2286 14.5648 8.3061 6.4179 10.5428 2.0856 0.9996 7.2389 27.5986 0.0643 36.9809 8.8902 0.1899 9.3753 102.0869 0.7471 155.6216 0.4685 18.6736 0.3240 19.9374 13.1412 0.6571 27.5437 12.1458 5.2824 10.1567 166.4853 11.4813 1.8924 10.9766 6.0969 2.4673 1.5747 12.2224 0.2236 0.7943 12.5977 8.5201 0.1615 27.8359 94.8436 510.5586 198.0558 56.4741 93.3557 0.1022 4.9307 0.8151 0.8503 150.6433 40.4849 0.0989 0.4240 17.2099 1.0447 1.3178 82.3558 67.0314 98.7006 53.6807 4.6635 6.1090 1.4640 26.9408 63.3409
temp: 298.150 k
press: 1.00000 atm
elementType: 17 8 8 7 6 6 6 6 6 6 6 6 6 6 6 6 6 6 6 6 6 1 1 1 1 1 1 1 1 1 1 1 1 1 1 1 1 1 1 1 1
symmnumber: 1
zpe: 872543.5 jmol-1
zpe.correction: 0.332334 hartree
zpe.thermalcorrener: 0.353695 hartree
zpe.thermalcorrenthalpy: 0.354639 hartree
zpe.thermalcorrgfe: 0.279332 hartree
zpe.sumelectzpe: -1323.522432 hartree
zpe.sumelectthermal: -1323.501072 hartree
zpe.sumelectthermalent: -1323.500128 hartree
zpe.sumelectthermalfe: -1323.575435 hartree
dipole: 2.9969 -3.1798 0.0261
dipole: 4.3696
quadrupole: -120.7150 -140.1563 -133.2219
quadrupole: 23.0820 0.1827 0.3791
quadrupole: 10.6494 -8.7919 -1.8575 23.0820 0.1827 0.3791
hfenergy: -1323.8547667 hartree
pointgroup: C01 [X(C17H20Cl1N1O2)]
dipole: 1.146718 1.2256582 0.3717496 debye
polarizability: 334.4863279|0.392998|226.2592293|-1.6038426|34.8765699|119.6191365 unknown
InChI: InChI=1S/C17H20ClNO2/c1-2-3-4-5-8-11-19-15-14(18)16(20)12-9-6-7-10-13(12)17(15)21/h6-7,9-10,19H,2-5,8,11H2,1H3
charge 0 multiplicity 1
41 atoms
Cl -1.108328 -3.218173 -1.013944
O  -0.689966 1.751091 0.441342
O  -4.032705 -2.480888 -0.741292
N  0.451504 -0.747115 -0.29809
C  4.103593 0.402507 0.093893
C  5.466312 -0.301578 -0.094246
C  2.903824 -0.519417 -0.217116
C  6.672108 0.607181 0.234145
C  1.555247 0.19914 -0.014878
C  8.034747 -0.100282 0.053195
C  -0.905105 -0.56412 -0.228369
C  9.23564 0.809639 0.390025
C  -2.946489 0.924245 0.243525
C  -1.466822 0.780971 0.174793
C  -3.805206 -0.16703 -0.06213
C  -1.801518 -1.600389 -0.523948
C  -3.252343 -1.507518 -0.470736
C  -3.498027 2.174082 0.621927
C  -5.205598 0.000093 0.014551
C  -4.89626 2.335614 0.69667
C  -5.750595 1.24664 0.392855
H  4.02337 0.771353 1.137199
H  4.060348 1.298927 -0.558447
H  5.553215 -0.661633 -1.140666
H  5.503994 -1.205037 0.549859
H  2.980116 -0.881582 -1.263208
H  2.949949 -1.41282 0.439812
H  6.640742 1.510056 -0.41113
H  6.585618 0.969886 1.279795
H  1.47041 0.581065 1.018901
H  1.479322 1.080412 -0.677624
H  8.122769 -0.459481 -0.992531
H  8.062905 -1.004371 0.695327
H  0.737454 -1.691836 -0.581561
H  9.25032 1.704706 -0.260249
H  9.186381 1.158947 1.438688
H  10.196196 0.279268 0.255678
H  -2.814618 2.997648 0.851139
H  -5.84033 -0.858084 -0.22651
H  -5.321804 3.301127 0.989098
H  -6.837166 1.371655 0.450957
