program: Gaussian 09
title: 000260178
version: EM64L-G09RevD.01
frameworkgroup: C1[X(C13H12ClNO3)]
method: RPBEPBE
basis: SDD
operation: Freq
keyword: #p
keyword: freq=noraman
keyword: PBEPBE/SDD
title: #p freq=noraman PBEPBE/SDD
converged: YES YES NO NO
title: Mulliken charges:
elementType: Cl O O O N C C C C C C C C C C C C C H H H H H H H H H H H H
charge: -0.013550 -0.300642 -0.213534 -0.201506 -0.389403 0.580363 0.334128 0.293392 -0.129418 -0.351634 -0.632934 0.011929 -0.281163 -0.374867 -0.374674 -0.232418 -0.222265 -0.489177 0.242451 0.260358 0.345076 0.208673 0.206098 0.288650 0.296348 0.239844 0.240577 0.241345 0.209172 0.208783
chargesum: 0.00000
title: Mulliken charges with hydrogens summed into heavy atoms:
elementType: Cl O O O N C C C C C C C C C C C C C
charge: -0.013550 -0.300642 -0.213534 -0.201506 -0.044327 0.580363 0.334128 0.293392 -0.129418 0.151175 -0.632934 0.011929 0.133608 -0.086217 -0.078326 0.007426 0.018312 0.170122
polarizability: 2.71714472e+02 -7.44618134e+00 2.05219870e+02 -4.27643663e+00 2.01607661e+00 7.71808918e+01
1716.lowfreq: 0.0014 0.0019 0.0022 4.8709 6.1370 11.4965 24.9892 44.5299 57.0743
frequency: 24.7521 44.5267 57.0610 65.3753 91.3468 112.4963 126.8317 150.0527 172.4614 198.4110 213.5692 246.7634 270.8986 277.5393 296.0879 326.7966 370.3256 383.7350 417.8556 425.4006 438.7937 470.7213 527.3152 536.5112 581.8610 651.7399 680.9060 701.3509 725.9457 769.5310 785.8474 802.9565 807.7222 839.2023 856.7846 893.5873 934.3224 990.0357 994.8742 999.3537 1013.0250 1035.0792 1062.0872 1082.5076 1087.9981 1101.2200 1121.7544 1145.4169 1165.9622 1171.9547 1204.7488 1233.8226 1238.1064 1269.9255 1297.8314 1330.4097 1371.4938 1394.7001 1400.3643 1435.8896 1438.6515 1451.0622 1460.1626 1466.3622 1467.4578 1470.1174 1484.5587 1523.4327 1544.3562 1577.9087 1601.6492 1608.9020 2935.5315 2942.9576 2985.4648 3006.5404 3018.1991 3112.0824 3113.6047 3136.9540 3152.4619 3163.6830 3172.6969 3413.5159
redmass: 4.7412 4.5999 3.6931 7.8987 2.6930 4.2297 4.7973 4.7497 6.6315 2.9380 2.1063 1.9679 4.9420 6.2683 5.5864 8.7144 8.2934 5.0777 3.8612 6.6388 4.6728 8.5555 4.3424 5.1204 4.5927 5.6103 4.3402 6.9020 2.7352 1.3639 2.2224 1.7241 5.5178 6.3609 3.0326 2.9437 1.8126 4.5024 1.3950 2.8444 1.3600 2.1598 3.3401 2.4261 2.0408 3.4819 1.3784 1.6261 1.8343 1.1418 1.1811 1.3735 2.1913 2.2783 3.1066 1.2804 1.3502 5.4202 9.0154 1.4382 1.8341 1.4580 1.0545 1.0840 1.0748 2.6178 1.0882 10.6083 10.5228 5.4913 7.0649 6.7178 1.0440 1.0465 1.0799 1.0951 1.1034 1.0929 1.0982 1.0863 1.0904 1.0945 1.1001 1.0750
irintensity: 1.1364 4.1943 2.3262 1.6949 5.7074 4.0684 0.4550 3.4010 0.4542 1.2808 6.0431 2.8663 1.4835 0.3116 2.8643 4.2051 9.0361 13.3801 0.9166 5.8994 0.3417 3.5393 6.5987 1.8615 11.6441 6.2433 10.2609 1.8561 72.2201 35.8776 74.8822 41.3618 65.9837 0.1066 4.8522 11.5593 0.1456 33.4116 4.4066 33.2531 0.2738 4.2244 106.1767 0.2157 10.5051 51.5134 2.2231 41.0301 28.8713 5.2570 11.3604 68.0507 79.1961 114.7996 36.1985 16.2441 2.3262 147.9232 5.9187 11.4609 7.5898 4.4090 12.3112 8.7765 57.2365 2.5283 10.8749 113.5780 471.2529 270.2231 65.7966 86.8605 43.1712 115.7748 1.6095 99.6231 56.3881 7.2519 21.0123 4.7632 6.9848 1.5122 26.5872 184.4726
temp: 298.150 k
press: 1.00000 atm
elementType: 17 8 8 8 7 6 6 6 6 6 6 6 6 6 6 6 6 6 1 1 1 1 1 1 1 1 1 1 1 1
symmnumber: 1
zpe: 590203.1 jmol-1
zpe.correction: 0.224797 hartree
zpe.thermalcorrener: 0.241596 hartree
zpe.thermalcorrenthalpy: 0.242540 hartree
zpe.thermalcorrgfe: 0.178683 hartree
zpe.sumelectzpe: -1241.749870 hartree
zpe.sumelectthermal: -1241.733071 hartree
zpe.sumelectthermalent: -1241.732126 hartree
zpe.sumelectthermalfe: -1241.795983 hartree
dipole: 2.6559 -4.2683 1.2730
dipole: 5.1858
quadrupole: -73.1352 -123.4881 -113.3354
quadrupole: 4.0516 4.8975 -1.3220
quadrupole: 30.1844 -20.1686 -10.0158 4.0516 4.8975 -1.3220
hfenergy: -1241.9746665 hartree
pointgroup: C01 [X(C13H12Cl1N1O3)]
dipole: -1.0741219 -1.7241641 -0.190158 debye
polarizability: 271.819281|5.2664306|200.3604502|-7.1901378|-24.0219773|81.9355028 unknown
InChI: InChI=1S/C13H12ClNO3/c1-18-7-6-15-11-10(14)12(16)8-4-2-3-5-9(8)13(11)17/h2-5,15H,6-7H2,1H3
charge 0 multiplicity 1
30 atoms
Cl -1.378062 2.688056 -0.359694
O  -4.721739 -0.019535 0.428616
O  -0.100313 -2.255706 0.61745
O  1.637024 2.858464 -0.522969
N  -2.032265 -0.188318 0.208189
C  -0.68672 0.044276 0.124058
C  1.750857 -0.776475 0.187375
C  2.19883 0.541936 -0.098528
C  0.301304 -1.08433 0.325843
C  -2.776253 -1.431837 0.480187
C  -0.183108 1.327261 -0.141006
C  1.223214 1.677333 -0.270546
C  -4.183679 -1.276369 -0.106841
C  2.692646 -1.823636 0.34976
C  3.581446 0.802294 -0.22019
C  4.071724 -1.55916 0.226003
C  4.51619 -0.244276 -0.059849
C  -6.024631 0.335559 -0.133969
H  -2.842243 -1.607309 1.572099
H  -2.266007 -2.300885 0.041601
H  -2.645475 0.638984 0.164564
H  -4.816266 -2.137532 0.195023
H  -4.144013 -1.228009 -1.217288
H  2.321331 -2.828853 0.57213
H  3.894411 1.82787 -0.438456
H  4.79861 -2.368414 0.351434
H  5.587692 -0.038141 -0.155446
H  -6.309689 1.292282 0.32968
H  -6.788546 -0.432697 0.105825
H  -5.968767 0.459564 -1.235853
