program: Gaussian 09
title: 000260186
version: EM64L-G09RevD.01
frameworkgroup: C1[X(C14H14ClNO2)]
method: RPBEPBE
basis: SDD
operation: Freq
keyword: #p
keyword: freq=noraman
keyword: PBEPBE/SDD
title: #p freq=noraman PBEPBE/SDD
converged: YES YES NO NO
title: Mulliken charges:
elementType: Cl O O N C C C C C C C C C C C C C C H H H H H H H H H H H H H H
charge: -0.003138 -0.224870 -0.199157 -0.447748 0.269785 -0.677718 -0.676907 -0.742498 0.503717 -0.219659 0.331780 -0.548584 0.287805 0.072127 -0.365170 -0.368502 -0.230060 -0.220878 0.364423 0.245843 0.211359 0.214818 0.214885 0.245563 0.210831 0.226038 0.230619 0.225768 0.288915 0.297013 0.241670 0.241927
chargesum: 0.00000
title: Mulliken charges with hydrogens summed into heavy atoms:
elementType: Cl O O N C C C C C C C C C C C C C C
charge: -0.003138 -0.224870 -0.199157 -0.083325 0.269785 -0.005698 -0.005627 -0.060073 0.503717 -0.219659 0.331780 -0.548584 0.287805 0.072127 -0.076255 -0.071489 0.011610 0.021050
polarizability: 2.75255449e+02 8.37412044e+00 2.04131665e+02 5.26705833e-01 3.43979544e-01 9.01559877e+01
1716.lowfreq: -0.0011 0.0017 0.0020 8.0073 8.2256 12.7484 27.9387 55.9864 78.3928
frequency: 27.4669 55.9753 78.3616 124.8255 130.9764 140.5191 168.6310 180.9810 192.4168 215.5136 229.0089 264.9014 268.5674 276.9777 301.3194 324.2403 352.6250 381.1446 398.2016 418.6035 433.0548 445.3492 461.9637 472.1499 519.9419 557.2540 612.3931 645.9612 682.5682 703.5358 724.9754 738.2173 758.6743 790.3398 801.5046 837.6001 853.3507 908.3856 919.2426 926.0144 926.7993 951.5282 993.7291 1006.4063 1013.7067 1033.3632 1034.1082 1047.8466 1084.1026 1124.7598 1172.3012 1201.7822 1219.4346 1232.5193 1239.9320 1258.5290 1288.5310 1305.7316 1377.8796 1380.8808 1403.8688 1406.2065 1441.8117 1453.3685 1465.1840 1470.4759 1472.9216 1474.9939 1487.5415 1501.0663 1513.6789 1518.7547 1579.0359 1600.2741 1605.0026 1611.6346 2980.8957 2990.1907 2993.9615 3074.2605 3081.2125 3084.0982 3100.9043 3125.2181 3127.7319 3139.0259 3154.7593 3166.6641 3174.9874 3316.9631
redmass: 4.9613 7.2252 3.8952 3.8618 3.7620 2.7068 5.5550 1.3391 4.0552 5.7696 1.2581 3.3511 1.0581 6.2426 5.3591 6.9526 2.6013 5.3937 4.0406 3.7620 3.4876 5.2823 3.4660 4.1776 4.9192 6.1203 7.2587 6.5958 4.3198 7.1093 3.1994 5.2840 1.1469 5.7965 1.6575 3.8774 4.8550 2.9595 1.6661 1.9190 1.6001 1.1967 1.3902 5.0550 1.3597 1.3909 1.5418 2.0673 2.7314 2.5015 1.0759 2.4803 2.7673 3.1267 1.9719 4.1663 2.8479 4.2865 1.1941 1.1988 9.2831 1.2127 2.5487 1.0481 1.1044 2.2470 1.0467 1.1243 1.0515 1.0906 2.6497 6.1833 4.0475 2.9020 6.3526 9.3657 1.0365 1.0372 1.0379 1.1008 1.0997 1.0994 1.0985 1.0976 1.0973 1.0865 1.0906 1.0946 1.1000 1.0740
irintensity: 1.0824 3.4869 0.6893 0.1902 1.0308 0.1200 0.4855 0.0775 1.4091 1.5258 0.3371 0.1461 0.0486 0.0141 1.1341 1.5033 0.1821 8.2030 14.8368 0.1659 0.9993 10.4255 0.6770 2.1029 8.9180 7.6415 9.3879 7.1401 12.0839 0.6438 41.0748 6.8604 65.7165 42.3907 41.6781 4.6165 6.8947 19.0769 0.2038 1.0920 0.1067 0.2297 3.5459 40.3615 0.3708 0.5255 7.8506 9.1054 2.4143 86.4902 6.4985 137.8424 63.6929 22.9241 36.2476 78.7548 208.1843 52.8588 30.8527 28.1355 0.7672 44.0555 12.9658 1.0272 17.7953 12.0801 0.1490 42.6783 8.8899 14.0500 113.9423 503.3919 67.8769 86.3102 18.8060 220.9669 16.4248 33.0529 40.6004 12.5058 33.7840 30.2832 47.2734 0.0390 12.3166 4.6081 7.5248 1.0376 23.9751 80.3626
temp: 298.150 k
press: 1.00000 atm
elementType: 17 8 8 7 6 6 6 6 6 6 6 6 6 6 6 6 6 6 1 1 1 1 1 1 1 1 1 1 1 1 1 1
symmnumber: 1
zpe: 650375.5 jmol-1
zpe.correction: 0.247715 hartree
zpe.thermalcorrener: 0.264615 hartree
zpe.thermalcorrenthalpy: 0.265560 hartree
zpe.thermalcorrgfe: 0.203385 hartree
zpe.sumelectzpe: -1205.852913 hartree
zpe.sumelectthermal: -1205.836012 hartree
zpe.sumelectthermalent: -1205.835068 hartree
zpe.sumelectthermalfe: -1205.897242 hartree
dipole: -0.5905 -3.7694 0.0388
dipole: 3.8156
quadrupole: -83.5299 -126.3074 -114.2999
quadrupole: -2.1431 -0.0205 -0.0446
quadrupole: 24.5158 -18.2617 -6.2541 -2.1431 -0.0205 -0.0446
hfenergy: -1206.1006276 hartree
pointgroup: C01 [X(C14H14Cl1N1O2)]
dipole: -0.3184164 -1.4096467 0.4061673 debye
polarizability: 273.1652144|10.5497002|194.4301453|20.5648027|-30.1692873|101.9477419 unknown
InChI: InChI=1S/C14H14ClNO2/c1-14(2,3)16-11-10(15)12(17)8-6-4-5-7-9(8)13(11)18/h4-7,16H,1-3H3
charge 0 multiplicity 1
32 atoms
Cl -1.408592 2.387302 -1.139118
O  -0.047444 -2.424581 0.498434
O  1.476322 2.668593 -0.828598
N  -1.961695 -0.843421 -0.215568
C  -3.391802 -0.475319 -0.485287
C  -3.878724 0.640031 0.477386
C  -3.611236 -0.107224 -1.976833
C  -4.186853 -1.77583 -0.176551
C  -0.737247 -0.230752 -0.245136
C  0.333691 -1.247308 0.197044
C  1.751078 -0.845905 0.262964
C  -0.296681 1.055324 -0.579055
C  2.130249 0.477079 -0.081547
C  1.105683 1.487225 -0.521946
C  2.730589 -1.78605 0.673384
C  3.48889 0.855809 -0.013919
C  4.085117 -1.403235 0.739282
C  4.463601 -0.081103 0.395321
H  -1.84018 -1.825731 0.090913
H  -3.343397 1.586796 0.313579
H  -4.957048 0.818683 0.313998
H  -3.734398 0.329725 1.528108
H  -3.272807 -0.932825 -2.628667
H  -3.070466 0.808071 -2.259018
H  -4.689044 0.057595 -2.158016
H  -4.053758 -2.085632 0.876681
H  -5.262625 -1.60186 -0.345536
H  -3.869292 -2.605448 -0.835331
H  2.409521 -2.799302 0.933379
H  3.752285 1.882236 -0.285928
H  4.844401 -2.125693 1.055887
H  5.516662 0.215644 0.446593
