program: Gaussian 09
title: 000260134
version: EM64L-G09RevD.01
frameworkgroup: C1[X(C8H13NO2)]
method: RPBEPBE
basis: SDD
operation: Freq
keyword: #p
keyword: freq=noraman
keyword: PBEPBE/SDD
title: #p freq=noraman PBEPBE/SDD
converged: YES YES NO NO
title: Mulliken charges:
elementType: O O N C C C C C C C C H H H H H H H H H H H H H
charge: -0.295737 -0.298108 -0.094884 -0.454845 -0.446846 -0.373652 -0.366244 -0.076719 -0.390893 0.231209 -0.505801 0.234780 0.226490 0.232742 0.228522 0.232990 0.239476 0.226142 0.239753 0.268120 0.253659 0.222524 0.233678 0.233645
chargesum: 0.00000
title: Mulliken charges with hydrogens summed into heavy atoms:
elementType: O O N C C C C C C C C
charge: -0.295737 -0.298108 -0.094884 0.006426 0.014417 0.098813 0.099651 0.191401 -0.137235 0.231209 0.184046
polarizability: 1.74305719e+02 -4.36443780e+00 9.21478667e+01 1.04202673e+00 -8.82478669e-01 6.42478587e+01
1716.lowfreq: -12.3041 -2.9270 -0.0007 -0.0005 -0.0004 14.6519 49.9666 62.0530 76.9767
frequency: 49.8279 61.9934 76.9600 86.3387 117.9475 171.3393 209.3789 221.6285 250.2512 271.3703 336.7991 361.9244 515.0000 570.2138 611.1662 686.4955 688.1402 792.7455 817.5540 855.2816 866.8472 897.4124 913.9506 926.1335 970.9563 976.9180 1001.0114 1057.6114 1111.0126 1111.3646 1122.9369 1138.8554 1145.5419 1164.9960 1172.6191 1219.4439 1233.4908 1277.5244 1295.5899 1308.9868 1312.8419 1335.3548 1359.6616 1408.0313 1434.5214 1448.1877 1466.7439 1468.6646 1475.4079 1489.1741 1496.3198 1607.8388 1651.9534 2958.4997 2962.5173 2993.2013 3008.2678 3013.5713 3023.9593 3045.2710 3083.0462 3089.1587 3095.6864 3123.6031 3133.0309 3176.9109
redmass: 3.0171 2.7540 1.2842 3.9002 2.9767 2.5929 4.4162 2.4592 2.3764 5.3726 4.3678 2.2652 4.2705 1.8547 4.9772 5.5858 4.4277 2.0837 1.7663 1.9781 2.0355 3.9802 2.4641 1.4943 1.3508 1.6683 4.1816 1.9372 1.2997 1.7293 2.1060 2.3797 1.4557 1.3828 1.7276 1.2909 1.2496 1.7980 1.2601 1.3719 1.2323 1.4100 1.6591 1.8496 1.9472 1.0516 1.0540 1.0897 1.0887 1.0805 1.0959 10.0920 6.0262 1.0640 1.0634 1.0297 1.0788 1.0645 1.0866 1.0962 1.1004 1.1038 1.1051 1.0916 1.1039 1.0913
irintensity: 0.8655 2.4709 1.4296 0.7945 3.6970 0.2022 3.7437 2.3813 4.2550 15.6434 6.1708 5.0729 0.7704 2.5314 0.1135 3.0512 12.4590 12.6196 53.1401 1.2690 6.4442 13.5034 12.2100 1.3330 27.3537 12.0044 68.5158 21.3024 19.6227 203.2734 240.0765 70.9676 4.1130 1.5722 50.0610 12.3101 25.3230 7.0921 35.7251 16.3322 1.6643 54.4195 63.5814 78.5631 4.1895 11.4127 20.9816 12.5044 25.9285 3.6227 23.9389 422.9235 605.8566 97.9333 15.8988 60.0864 11.1692 20.4478 51.1012 34.7952 31.6534 36.8547 54.9353 1.1606 25.5390 9.6344
temp: 298.150 k
press: 1.00000 atm
elementType: 8 8 7 6 6 6 6 6 6 6 6 1 1 1 1 1 1 1 1 1 1 1 1 1
symmnumber: 1
zpe: 528312.7 jmol-1
zpe.correction: 0.201224 hartree
zpe.thermalcorrener: 0.212950 hartree
zpe.thermalcorrenthalpy: 0.213894 hartree
zpe.thermalcorrgfe: 0.162417 hartree
zpe.sumelectzpe: -516.975930 hartree
zpe.sumelectthermal: -516.964204 hartree
zpe.sumelectthermalent: -516.963260 hartree
zpe.sumelectthermalfe: -517.014737 hartree
dipole: -5.0100 -1.3429 0.0528
dipole: 5.1871
quadrupole: -53.2290 -67.8372 -66.6767
quadrupole: -4.9768 0.3789 0.0710
quadrupole: 9.3520 -5.2562 -4.0957 -4.9768 0.3789 0.0710
hfenergy: -517.177154 hartree
pointgroup: C01 [X(C8H13N1O2)]
dipole: -1.9760797 -0.5096423 0.0100535 debye
dipolederiv: -1.5993095 0.3443078 -0.0348116 0.7430741 -0.7245573 0.0293733 -0.0525271 0.0225301 -0.3177407 -0.9099238 -0.1715002 -0.0016114 -0.4739866 -0.9804892 0.0181603 0.0096555 0.0231061 -0.349372 -2.0406327 0.1216898 -0.047398 -0.3385231 -0.3510946 0.0504934 0.0558863 -0.0034019 -0.2756242 0.0536952 0.0355929 -0.005283 0.0130464 0.034441 -0.0407334 0.0497002 -0.0043234 0.1468164 0.0482023 -0.0250394 0.0449651 0.009625 0.0020552 -0.0223651 -0.0313282 -0.0002982 0.1372014 0.2259559 0.0928016 -0.0268602 0.4081323 0.3753855 -0.0262101 0.0208849 -0.0499716 0.3150365 0.5706279 -0.252487 0.0930692 -0.4566377 0.3104971 -0.0297482 0.012483 -0.054552 0.3165063 2.0456107 -0.0919068 0.0343596 -0.2986084 0.0797727 -0.0129436 0.0403895 0.0020058 0.0240065 -1.7494969 -0.0089076 -0.0189809 0.4361349 -0.0929428 -0.0087905 -0.0463686 -0.0125284 -0.3765067 2.5826334 -0.1161794 0.0437115 0.0331093 1.2736851 -0.0423432 0.0387424 -0.0457152 0.2332072 0.8018384 -0.0766166 0.0112715 0.0290524 0.2288563 0.0029027 0.0079828 0.0011745 0.2917004 -0.0160028 -0.0858338 0.0379949 -0.127851 -0.0627218 0.0589879 0.0711987 0.0842775 0.0480537 0.0356309 0.00921 -0.0317437 0.035999 0.0642219 -0.0021079 -0.0868825 -0.0470756 -0.1489202 -0.1468725 0.0870939 -0.0463873 0.1032795 0.0382742 0.0186266 -0.0797529 0.035917 0.0657903 0.0869914 -0.0138162 -0.0058149 -0.0305967 0.043162 0.0092975 0.0585741 -0.0145393 -0.1593485 0.0323008 0.0267646 -0.0566181 -0.1102894 -0.0258973 0.0595663 0.0000527 0.1117404 -0.1112474 0.0078037 0.091951 0.0767264 -0.0477321 -0.04115 -0.0629723 0.0161614 -0.0917179 -0.033226 -0.078373 0.0451964 -0.0191363 0.150053 -0.0079086 0.0637554 -0.1011901 0.135965 -0.1498587 0.007731 -0.054969 -0.039684 0.059691 -0.1010374 -0.0793567 0.0139125 -0.1080995 0.0096573 0.111682 -0.0131505 -0.0015147 -0.0090706 -0.0265169 0.0081122 0.0012288 0.0054875 0.1575297 0.0629923 -0.0480255 -0.0006799 -0.069767 -0.0534262 0.0112707 0.0005066 0.0101732 0.2106775 -0.0328294 0.088474 -0.0061572 0.1590501 -0.0753322 0.0107523 -0.009213 0.0095683 0.1149569 -0.0484279 0.0086023 -0.0148172 -0.1097645 0.0383967 -0.1153635 -0.0680902 -0.0875444 -0.0681544 -0.0518271 0.0067475 0.0154003 -0.1074198 0.0543266 0.101636 0.0779934 0.0778221 -0.0811412 unknown
polarizability: 174.2029998|-5.1425746|92.2422949|1.5505491|-0.8505108|64.2561497 unknown
InChI: InChI=1S/C8H13NO2/c1-11-8(10)4-7-9-5-2-3-6-9/h4,7H,2-3,5-6H2,1H3
charge 0 multiplicity 1
24 atoms
O  3.190742 -0.904523 0.066054
O  2.625798 1.368371 -0.036283
N  -1.492871 0.204169 -0.057396
C  -3.526021 -1.03956 -0.209231
C  -3.830949 0.385263 0.326994
C  -1.997262 -1.188558 -0.009495
C  -2.593128 1.199871 -0.114298
C  -0.166129 0.525967 -0.051516
C  0.895181 -0.360886 0.003174
C  2.254594 0.159619 0.006359
C  4.605884 -0.486243 0.074064
H  -4.092526 -1.825204 0.31742
H  -3.775531 -1.101833 -1.284298
H  -4.770789 0.802075 -0.071524
H  -3.898779 0.370239 1.430049
H  -1.746719 -1.648597 0.968556
H  -1.522599 -1.802237 -0.799159
H  -2.719849 1.588094 -1.146207
H  -2.381219 2.05534 0.551763
H  0.070751 1.597112 -0.091092
H  0.766635 -1.444726 0.048168
H  5.178288 -1.4244 0.123427
H  4.818791 0.152825 0.948743
H  4.851006 0.07812 -0.842574
