program: Gaussian 09
title: 000260112
version: EM64L-G09RevD.01
frameworkgroup: C1[X(C9H14N2O2)]
method: RPBEPBE
basis: SDD
operation: Freq
keyword: #p
keyword: freq=noraman
keyword: PBEPBE/SDD
title: #p freq=noraman PBEPBE/SDD
converged: YES YES NO NO
title: Mulliken charges:
elementType: O O N N C C C C C C C C C H H H H H H H H H H H H H H
charge: -0.255703 -0.213401 -0.037341 -0.112635 0.231163 0.235033 -0.440603 -0.037841 -0.223836 -0.220701 -0.769541 -0.678566 -0.678614 0.257823 0.222718 0.222735 0.218234 0.218251 0.230658 0.259926 0.230661 0.209266 0.230917 0.230927 0.204625 0.232920 0.232925
chargesum: 0.00000
title: Mulliken charges with hydrogens summed into heavy atoms:
elementType: O O N N C C C C C C C C C
charge: -0.255703 -0.213401 -0.037341 -0.112635 0.231163 0.235033 -0.182780 -0.037841 0.221617 0.215784 -0.048295 -0.007456 -0.008144
polarizability: 1.46814284e+02 -1.17893890e+00 1.52643382e+02 1.05086657e-04 5.24411780e-03 7.23575270e+01
1716.lowfreq: -81.6738 -9.0670 -2.6992 -0.0005 0.0001 0.0009 2.2458 49.6634 59.0622
frequency: -81.6494 49.6598 59.0132 80.7144 88.7958 99.9515 159.9095 188.0565 208.0323 228.8426 248.2173 250.2070 281.6580 299.8907 338.3998 402.5164 491.4238 536.6422 583.7868 646.8377 654.4168 674.4089 768.5215 802.1149 805.0690 830.8628 842.8894 857.1155 918.8380 975.7094 983.9305 1018.4360 1036.5883 1048.4209 1070.8266 1111.4655 1116.4290 1133.9458 1135.1599 1160.3211 1245.9591 1249.6854 1279.7338 1302.1411 1330.9754 1363.4277 1376.5886 1385.1788 1396.6383 1400.7015 1410.3144 1452.5102 1459.5633 1462.2748 1467.6650 1471.3309 1473.8093 1486.4693 1488.0387 1525.4507 1556.9445 2989.5367 2995.5828 2996.1100 3001.8431 3006.6844 3060.3709 3065.5174 3069.5629 3092.8441 3093.1000 3107.9718 3109.2009 3123.8438 3193.9269
redmass: 1.0190 2.3531 3.5092 1.8959 3.3670 2.0713 3.4092 2.9435 2.5859 3.6582 1.6402 1.5693 3.1585 3.0465 3.3064 5.1821 4.1909 5.6945 3.9795 6.6878 5.6528 5.2106 6.1720 1.0972 1.0937 3.8898 3.4283 1.4382 8.4387 2.3151 2.1723 2.3820 2.7803 1.5923 3.9336 2.2296 2.3777 1.4514 1.4501 1.8453 1.1395 1.1379 6.8865 2.8399 1.6582 3.3459 1.9191 1.3527 1.3539 1.3411 2.7490 1.2047 1.0404 1.0401 1.0463 1.0721 1.0649 1.0805 1.0759 4.5121 7.0110 1.0380 1.0376 1.0360 1.0558 1.0577 1.1069 1.1068 1.0972 1.0985 1.0984 1.1023 1.1020 1.0986 1.0939
irintensity: 0.3754 0.1535 0.7879 0.1033 0.0011 9.8730 6.1595 1.9341 0.0258 1.2156 0.6413 2.5074 0.5119 2.6346 5.0077 2.9009 0.9717 4.5872 5.4474 5.2934 13.1899 2.1606 3.5294 2.2102 6.1086 17.9858 4.3001 34.9311 5.9807 33.7722 0.8611 5.6539 135.5851 7.4949 125.8439 6.1670 30.3879 0.4293 8.3018 106.3861 0.0034 0.0049 58.0749 434.9258 156.6954 16.5370 108.2155 50.8276 12.8972 21.6436 9.3102 123.0130 11.1847 11.8097 17.6127 6.9317 15.6247 19.8227 3.8449 264.9936 399.7186 15.0355 35.7037 14.1060 18.3246 25.8045 14.1070 11.1903 17.2881 12.9072 45.1595 37.9393 47.1677 8.6316 0.8503
temp: 298.150 k
press: 1.00000 atm
elementType: 8 8 7 7 6 6 6 6 6 6 6 6 6 1 1 1 1 1 1 1 1 1 1 1 1 1 1
symmnumber: 1
zpe: 578272.0 jmol-1
zpe.correction: 0.220252 hartree
zpe.thermalcorrener: 0.233749 hartree
zpe.thermalcorrenthalpy: 0.234693 hartree
zpe.thermalcorrgfe: 0.179342 hartree
zpe.sumelectzpe: -610.299270 hartree
zpe.sumelectthermal: -610.285773 hartree
zpe.sumelectthermalent: -610.284829 hartree
zpe.sumelectthermalfe: -610.340180 hartree
dipole: -2.3079 -2.0848 0.0002
dipole: 3.1102
quadrupole: -80.7134 -63.9763 -77.6441
quadrupole: -3.7282 -0.0006 0.0008
quadrupole: -6.6022 10.1350 -3.5328 -3.7282 -0.0006 0.0008
hfenergy: -610.519522 hartree
pointgroup: C01 [X(C9H14N2O2)]
dipole: -0.913052 -0.8146189 0.0009654 debye
polarizability: 146.7998741|-1.1428613|152.6577119|-0.0766826|0.0110608|72.3576068 unknown
InChI: InChI=1S/C9H14N2O2/c1-4-12-8-6-7(3)10-9(11-8)13-5-2/h6H,4-5H2,1-3H3
charge 0 multiplicity 1
27 atoms
O  -2.418714 -0.24184 0.002042
O  2.290181 -0.619953 -0.002509
N  1.362846 1.488905 -0.001686
N  -0.064379 -0.491634 -0.000614
C  0.241493 2.282898 -0.000211
C  -1.157106 0.318476 0.000838
C  -1.06104 1.730281 0.001016
C  1.143062 0.146497 -0.002037
C  -2.512093 -1.731666 0.001965
C  2.123766 -2.100754 -0.002453
C  0.468667 3.778005 -0.00009
C  -4.000307 -2.065794 0.004378
C  3.5331 -2.68439 -0.003675
H  -1.957925 2.351222 0.002127
H  -1.992353 -2.117773 -0.893667
H  -1.989331 -2.118116 0.895672
H  1.544823 -2.39398 0.892704
H  1.543284 -2.393849 -0.896647
H  0.013618 4.248456 0.890893
H  1.549256 3.985061 -0.001231
H  0.011647 4.248912 -0.889823
H  -4.136669 -3.162732 0.004095
H  -4.495118 -1.65338 0.900109
H  -4.498175 -1.652547 -0.889272
H  3.481239 -3.788714 -0.003547
H  4.091122 -2.360056 -0.898304
H  4.092702 -2.359937 0.889925
