program: Gaussian 09
title: 000260110
version: EM64L-G09RevD.01
frameworkgroup: C1[X(C7H5N3O4)]
method: RPBEPBE
basis: SDD
operation: Freq
keyword: #pfreq=noraman
keyword: PBEPBE/SDD
title: #p freq=noraman PBEPBE/SDD
converged: NO YES NO YES
title: Mulliken charges:
elementType: O O O O N N N C C C C C C C H H H H H
charge: -0.241031 -0.242159 -0.456790 -0.219302 -0.411169 -0.401644 -0.397526 0.087196 0.286400 -0.454777 0.310208 0.141276 0.130782 0.093681 0.370572 0.286350 0.351399 0.369767 0.396768
chargesum: 0.00000
title: Mulliken charges with hydrogens summed into heavy atoms:
elementType: O O O O N N N C C C C C C C
charge: -0.241031 -0.242159 -0.060021 -0.219302 -0.040598 -0.050245 -0.027759 0.087196 0.286400 -0.168428 0.310208 0.141276 0.130782 0.093681
polarizability: 1.88935863e+02 -4.33916802e+00 1.20922852e+02 -5.89543023e-03 -6.78864486e-03 4.32758137e+01
1716.lowfreq: -0.0006 -0.0005 0.0007 2.4310 5.0260 5.3289 71.9697 81.4704 119.5320
frequency: 71.9649 81.4537 119.5319 155.7427 172.4053 222.2033 269.3858 302.7420 358.1730 371.9909 476.9312 498.8232 517.5091 534.9916 589.4140 600.2501 615.8399 621.7310 656.7607 683.4357 689.2938 705.8259 722.8715 738.3906 769.5292 839.9820 842.7972 943.0443 960.8917 1025.7079 1095.2213 1135.7149 1199.6616 1229.7310 1284.0347 1313.0681 1343.3097 1362.8626 1408.0231 1454.5793 1487.1767 1549.2935 1579.7220 1648.3794 1669.5196 1676.3881 3237.6018 3526.9119 3552.4232 3573.0521 3584.8454
redmass: 8.8906 11.6521 8.7517 7.1057 7.8211 5.1889 9.2991 10.0487 7.5053 11.2071 8.5242 7.3771 6.9826 1.4690 6.1425 1.3926 2.3887 2.8140 4.8039 5.2976 1.7635 1.7300 3.4060 3.3992 2.9904 5.5456 1.5200 8.0516 3.4883 2.8403 2.7163 1.8097 1.6122 7.0509 2.9270 2.4858 2.0947 1.7127 5.2466 3.9485 9.5438 4.8882 8.5540 8.4680 5.9847 7.3026 1.0992 1.0770 1.0648 1.0783 1.0818
irintensity: 0.1936 2.1633 3.8834 0.4835 3.2108 0.5472 6.2856 1.9956 0.4981 19.0795 20.0107 23.8976 17.0899 99.2638 19.0848 122.1806 2.1294 15.9086 5.1677 6.3092 1.3745 29.1356 89.2436 85.0799 110.0820 7.0264 64.2134 118.8750 39.4261 179.9759 8.3764 205.1426 13.3777 114.3058 9.3716 185.2336 70.7402 5.8979 58.0726 17.1807 33.4666 45.8023 66.7427 827.6478 692.3395 224.8399 1.8427 82.0408 71.7761 75.6426 141.9087
temp: 298.150 k
press: 1.00000 atm
elementType: 8 8 8 8 7 7 7 6 6 6 6 6 6 6 1 1 1 1 1
symmnumber: 1
zpe: 335379.9 jmol-1
zpe.correction: 0.127739 hartree
zpe.thermalcorrener: 0.138842 hartree
zpe.thermalcorrenthalpy: 0.139787 hartree
zpe.thermalcorrgfe: 0.090315 hartree
zpe.sumelectzpe: -733.970499 hartree
zpe.sumelectthermal: -733.959396 hartree
zpe.sumelectthermalent: -733.958452 hartree
zpe.sumelectthermalfe: -734.007923 hartree
dipole: 2.9124 -0.4449 -0.0006
dipole: 2.9462
quadrupole: -88.6735 -83.3322 -80.0435
quadrupole: 7.7275 0.0033 0.0010
quadrupole: -4.6571 0.6842 3.9729 7.7275 0.0033 0.0010
hfenergy: -734.0982385 hartree
pointgroup: C01 [X(C7H5N3O4)]
dipole: 1.1485589 -0.1561576 -0.0002498 debye
dipolederiv: -0.6111826 0.0526014 0.0000112 0.2095231 -1.2964267 0.0000113 -0.0000218 0.0000736 -0.360818 -1.4643981 -0.348633 -0.0000673 -0.4874704 -0.6706441 -0.000024 0.0006123 0.0002198 -0.3872491 -0.7317499 -0.3447157 0.0000342 -0.7341102 -1.0174407 0.0000064 -0.0002307 -0.0003049 -0.4406501 -1.164913 0.3183741 0.0001219 0.3837017 -0.8014072 -0.0002036 -0.0004073 0.0002662 -0.3213536 0.1589129 -0.277571 -0.0000004 -0.3403963 -0.5915504 0.0000814 0.0001142 0.0000645 -0.1869866 -1.2856537 -0.2743275 0.0001327 0.2062842 -0.4190114 -0.0000604 -0.0000249 0.0000512 -0.3082327 -0.8986452 -0.4394104 0.0000546 -0.6047889 -1.0305469 0.0001683 -0.0000158 -0.0000038 -0.3626848 -0.7326304 0.6175424 -0.0000298 0.3385329 -0.300778 -0.00002 0.0000275 -0.0000434 0.0028572 0.7425138 0.4502739 -0.0000477 0.4059578 0.2722674 0.0000051 0.0000202 -0.0000393 0.0533908 0.0033593 -0.2303171 -0.0000044 0.0740428 -0.0228625 -0.0000212 -0.0000098 -0.0000427 -0.2121132 -1.2387867 0.117317 0.0000208 0.0537025 0.3252369 -0.0000786 0.0001556 -0.0000313 0.0280841 1.6656818 -0.0336694 -0.0000585 -0.2458574 1.7135521 -0.0000494 -0.0000644 -0.0001116 0.2679382 2.1218542 0.3252415 -0.0000431 0.3596098 1.3052087 -0.0000567 -0.0005363 -0.0001793 0.3230931 2.4752341 -0.050289 -0.000071 0.2077842 1.4335147 0.0002244 0.0004243 0.0000785 0.2527488 0.2619974 0.0585385 0.0000096 0.0360324 0.3140303 -0.0000113 0.0000069 -0.0000067 0.3342857 0.1047789 0.0254263 0.0000058 0.0116245 0.0448048 0.0000211 -0.0000118 0.0000094 0.2096673 0.1366442 0.0104401 -0.0000095 0.0280572 0.2563373 0.0000197 -0.0000026 0.000028 0.3512268 0.2356318 -0.044674 0.0000062 -0.0659297 0.1736447 -0.000007 0.0000277 -0.0000138 0.3446934 0.221351 0.0678521 -0.0000654 0.1636998 0.3120711 -0.0000054 -0.0000634 -0.0000144 0.4121028 unknown
polarizability: 189.0601999|-3.2181312|120.7985147|-0.005783|-0.0068847|43.2758137 unknown
InChI: InChI=1S/C7H5N3O4/c11-5-4-2(9-7(14)10-5)1-3(8-4)6(12)13/h1,8-10,12H
charge 0 multiplicity 1
19 atoms
O  -1.488182 2.688178 -0.000201
O  -3.965652 -1.310868 0.00046
O  3.72801 1.130993 -0.000021
O  4.02849 -1.193902 0.000036
N  1.025711 0.921389 -0.000379
N  -1.628453 -1.479121 0.000044
N  -2.675395 0.651568 -0.000024
C  -0.308635 0.561429 -0.000184
C  -0.380602 -0.853997 -0.000067
C  0.948226 -1.363639 0.00001
C  1.801452 -0.233503 -0.000344
C  -1.475749 1.423473 -0.000097
C  -2.834533 -0.757464 -0.000142
C  3.263279 -0.202676 -0.000553
H  1.389667 1.8755 -0.000554
H  1.28642 -2.397387 0.000156
H  -1.721822 -2.495681 0.000245
H  -3.553894 1.180066 0.000127
H  4.72126 1.136142 0.000388
