program: Gaussian 09
title: 000260109
version: EM64L-G09RevD.01
frameworkgroup: C1[X(C10H15N3O3)]
method: RPBEPBE
basis: SDD
operation: Freq
keyword: #p
keyword: freq=noraman
keyword: PBEPBE/SDD
title: #p freq=noraman PBEPBE/SDD
converged: YES YES NO NO
title: Mulliken charges:
elementType: O O O N N N C C C C C C C C C C H H H H H H H H H H H H H H H
charge: -0.289460 -0.210572 -0.244881 -0.021175 -0.099013 -0.394525 0.106082 0.175103 0.156069 -0.031672 -0.773316 -0.216173 -0.221802 -0.679502 -0.678415 -0.071195 0.293351 0.217827 0.251976 0.228962 0.226223 0.323121 0.217143 0.218506 0.215979 0.226880 0.232970 0.205127 0.234631 0.233533 0.168217
chargesum: 0.00000
title: Mulliken charges with hydrogens summed into heavy atoms:
elementType: O O O N N N C C C C C C C C C C
charge: -0.289460 -0.210572 -0.244881 -0.021175 -0.099013 -0.071404 0.106082 0.175103 0.156069 -0.031672 -0.010161 0.239011 0.213847 -0.003672 -0.005122 0.097022
polarizability: 2.00416716e+02 3.33667796e+00 1.63018846e+02 -8.33690647e-01 -1.45007497e+00 8.77664199e+01
1716.lowfreq: -7.0743 -0.0011 -0.0009 -0.0009 4.3979 6.4719 41.0213 45.1969 65.5100
frequency: 41.0207 45.1436 65.4940 74.5931 87.6558 96.9540 117.3235 128.5179 151.6759 191.0933 205.3671 225.9637 234.5889 246.4941 252.8111 294.5321 302.7315 313.2353 323.1556 406.1144 426.3346 488.0194 543.0194 574.9143 607.6148 631.7619 652.1051 689.9191 736.7086 764.7396 801.3952 806.6161 819.2471 839.9548 860.0512 949.1958 956.3505 994.2306 1019.8610 1045.8211 1049.3949 1078.4850 1100.0097 1111.6562 1116.3256 1135.1635 1136.7598 1230.1285 1246.5807 1251.6579 1282.2737 1320.6066 1322.7789 1343.9378 1373.9675 1386.3770 1396.2814 1398.5999 1405.7637 1416.5025 1445.6461 1460.0149 1460.2886 1463.5585 1465.3330 1472.8790 1475.2115 1487.4626 1489.0066 1526.5868 1559.0152 1643.1679 2935.8100 2987.8214 2996.1366 2996.4701 3000.9541 3011.1019 3059.2232 3066.9551 3070.3377 3093.5513 3094.2245 3107.1810 3109.4108 3127.1557 3492.7950
redmass: 4.2188 3.1266 3.0777 2.0528 3.3632 2.6447 3.4668 2.9196 1.3160 3.4765 2.7070 2.2744 2.6741 1.7418 1.7463 3.5395 3.3403 4.0314 3.1651 5.7440 4.5220 5.1954 6.5169 4.2881 4.2437 1.3673 5.6189 8.9747 7.9517 9.0764 1.0958 1.0953 5.6688 3.5509 4.1727 2.5809 1.8279 2.5526 2.3193 2.6245 2.0102 2.6378 4.5792 2.2305 2.4904 1.4533 1.4524 3.2814 1.1389 1.1365 5.8634 2.1045 3.1016 2.3378 1.2625 1.5592 1.3374 1.2975 1.6325 2.7765 1.1736 1.1620 1.0420 1.0563 1.8896 1.0832 1.0989 1.0818 1.0853 4.3775 6.4958 5.1393 1.0864 1.0376 1.0368 1.0393 1.0531 1.0580 1.1070 1.0961 1.1065 1.0986 1.0985 1.1029 1.1019 1.0996 1.0764
irintensity: 1.6936 0.9106 2.9023 0.1839 0.1424 4.9085 9.8363 5.6486 2.2683 10.2043 2.9553 3.7068 3.4967 0.1939 4.3823 6.0007 1.8940 1.5340 5.2102 2.0776 3.0594 12.0576 3.4142 1.0496 22.0491 93.2583 14.5176 5.4308 7.7082 4.8081 3.9362 4.7795 8.4614 7.8124 25.9399 25.4623 3.4489 5.2406 9.6297 132.7386 49.5894 72.9417 146.3873 9.7153 53.8497 1.8855 7.8163 29.5758 0.1801 0.0183 48.0674 409.8249 144.3227 68.6011 3.4185 169.9162 173.0319 7.9691 17.2774 90.8095 112.4829 72.7968 14.2899 27.0850 327.2238 3.7402 13.0656 12.2405 20.7233 179.0363 97.1182 241.4731 121.0228 8.8000 37.5289 7.3475 25.3736 22.0345 16.0058 9.5809 6.2265 21.2701 35.0449 40.3764 42.5228 8.0291 31.2706
temp: 298.150 k
press: 1.00000 atm
elementType: 8 8 8 7 7 7 6 6 6 6 6 6 6 6 6 6 1 1 1 1 1 1 1 1 1 1 1 1 1 1 1
symmnumber: 1
zpe: 647256.7 jmol-1
zpe.correction: 0.246527 hartree
zpe.thermalcorrener: 0.263779 hartree
zpe.thermalcorrenthalpy: 0.264723 hartree
zpe.thermalcorrgfe: 0.200726 hartree
zpe.sumelectzpe: -778.766433 hartree
zpe.sumelectthermal: -778.749181 hartree
zpe.sumelectthermalent: -778.748237 hartree
zpe.sumelectthermalfe: -778.812234 hartree
dipole: 1.2594 6.2983 -2.0085
dipole: 6.7297
quadrupole: -87.8623 -93.3728 -96.6583
quadrupole: -1.8819 10.0183 2.6853
quadrupole: 4.7688 -0.7417 -4.0271 -1.8819 10.0183 2.6853
hfenergy: -779.0129601 hartree
pointgroup: C01 [X(C10H15N3O3)]
dipole: -0.3632834 -2.3348512 1.1943981 debye
polarizability: 193.963316|-14.5428766|166.8013249|1.1240186|-14.5590388|90.4373418 unknown
InChI: InChI=1S/C10H15N3O3/c1-4-15-9-8(11-6-14)7(3)12-10(13-9)16-5-2/h6,11H,4-5H2,1-3H3
charge 0 multiplicity 1
31 atoms
O  -1.31189 -1.532806 0.37013
O  2.994215 0.34881 -0.194851
O  -2.985239 2.421985 -1.595767
N  1.170162 1.752761 -0.09727
N  0.875936 -0.654095 0.101921
N  -2.491109 0.89659 0.143188
C  -1.069729 0.824609 0.073535
C  -0.187365 1.94165 -0.009133
C  -0.458837 -0.459638 0.169534
C  1.627642 0.477165 -0.064696
C  -0.666857 3.367165 0.031939
C  -0.697659 -2.889258 0.480333
C  3.562559 -1.027454 -0.156633
C  -1.848557 -3.870285 0.674371
C  5.069279 -0.867413 -0.33264
C  -3.338337 1.634738 -0.67939
H  -1.173694 3.630134 -0.914157
H  -1.411634 3.512932 0.836409
H  0.194827 4.031254 0.194173
H  -0.123504 -3.084976 -0.442851
H  0.006909 -2.885743 1.331404
H  -2.933675 0.156329 0.698527
H  3.297666 -1.495773 0.809447
H  3.104473 -1.625422 -0.966103
H  -1.450744 -4.898098 0.755547
H  -2.41218 -3.644651 1.59603
H  -2.545504 -3.835463 -0.180298
H  5.557274 -1.859085 -0.312012
H  5.302049 -0.382716 -1.295878
H  5.495142 -0.250655 0.476834
H  -4.405716 1.445506 -0.421544
