program: Gaussian 09
title: 000260096
version: EM64L-G09RevD.01
frameworkgroup: C1[X(C13H15NO)]
method: RPBEPBE
basis: SDD
operation: Freq
keyword: #p
keyword: freq=noraman
keyword: PBEPBE/SDD
title: #p freq=noraman PBEPBE/SDD
converged: YES YES NO NO
title: Mulliken charges:
elementType: O N C C C C C C C C C C C C C H H H H H H H H H H H H H H H
charge: -0.287412 -0.132456 -0.437620 -0.524550 -0.486351 0.289787 0.263430 -0.395955 -0.360220 0.137475 -0.239983 -0.246448 0.344855 -0.801761 -0.669856 0.255279 0.234604 0.227708 0.222131 0.237380 0.278558 0.232877 0.234507 0.228458 0.229354 0.222792 0.219102 0.269927 0.229683 0.224704
chargesum: 0.00000
title: Mulliken charges with hydrogens summed into heavy atoms:
elementType: O N C C C C C C C C C C C C C
charge: -0.287412 -0.132456 0.052262 -0.074711 0.029587 0.289787 0.263430 -0.163077 -0.125712 0.137475 -0.011525 -0.017094 0.344855 -0.089940 -0.215470
polarizability: 1.94084729e+02 -1.84500255e-01 1.52400684e+02 3.73676987e+00 -6.05435548e+00 8.78477813e+01
1716.lowfreq: -16.8117 -9.9313 -4.0572 -0.0006 -0.0005 -0.0003 29.1502 55.7438 63.5837
frequency: 28.7909 55.6574 63.5038 91.3393 154.4218 163.7102 198.2967 229.5888 245.8680 262.7104 334.4638 342.6603 361.3265 411.8212 428.4558 456.5693 498.6183 542.3573 553.1575 582.8315 616.7866 659.7233 703.7744 719.6275 727.9274 754.7578 761.8675 821.0712 869.1453 904.8185 928.7612 939.2741 950.0037 960.5215 983.5382 988.0406 997.1017 1015.1354 1037.9958 1053.8169 1058.3428 1111.0511 1165.7728 1171.7100 1175.1657 1193.9631 1200.2924 1225.9490 1237.9205 1272.2415 1283.5188 1328.7119 1340.4633 1362.4262 1385.2801 1387.2290 1402.5196 1430.0991 1441.6085 1450.3695 1452.7646 1468.3289 1474.0017 1477.0532 1491.5725 1543.3939 1595.2612 1617.1336 1649.8194 2935.0793 2958.7048 2974.1155 2977.9073 3034.2672 3051.1856 3061.9025 3091.1220 3099.8907 3107.5193 3113.6765 3117.7491 3138.6741 3160.7792 3193.0972
redmass: 3.8149 3.1598 5.2151 3.5267 3.0228 1.0899 2.8867 4.5565 2.8538 3.2164 4.2904 2.6825 2.8678 3.3273 2.6312 3.1732 3.7184 4.2686 3.4617 3.9177 2.7781 1.9411 3.2685 2.9625 4.3505 1.2974 2.1855 3.2017 1.3177 3.0554 2.4540 1.4313 1.3462 1.9833 1.7385 1.3440 1.7838 1.7900 2.2914 1.5161 2.0637 1.9340 2.1659 1.4890 1.1055 1.2761 2.1304 1.5822 2.3667 1.8445 1.7405 1.7218 1.4706 1.4636 3.9365 1.2947 2.3048 1.4534 2.3831 1.1134 1.0497 1.1392 1.1182 1.0860 2.2270 8.1076 6.7339 6.4545 5.0190 1.0705 1.0717 1.0617 1.0378 1.0987 1.0885 1.0947 1.0622 1.1006 1.0916 1.0866 1.0895 1.0928 1.1005 1.1144
irintensity: 0.0629 0.1320 4.2410 0.5999 0.0646 0.5441 1.3913 6.0030 6.9909 3.9225 10.4148 0.8738 5.0601 3.4120 7.1718 3.6874 1.1090 12.5700 0.3923 1.6781 6.5961 3.6936 1.8176 12.2309 2.8614 63.5450 8.7031 11.0335 0.0707 0.3155 26.2792 3.6267 54.1668 0.9678 11.1440 0.4753 1.2528 7.8765 7.8318 5.2799 16.0869 22.8836 4.0970 95.8567 8.3590 40.1609 6.3547 3.8255 13.4553 6.3390 14.2477 19.6017 6.7245 4.7015 17.4458 31.2624 49.8396 56.9472 3.3600 9.9872 18.0605 24.4430 18.9379 35.8273 20.1971 272.7784 4.2798 1.3609 9.6480 30.0093 38.1346 33.5029 23.9764 37.2492 6.9820 15.5979 6.6312 16.7546 10.0571 13.0123 1.7736 26.1872 33.1200 25.3351
temp: 298.150 k
press: 1.00000 atm
elementType: 8 7 6 6 6 6 6 6 6 6 6 6 6 6 6 1 1 1 1 1 1 1 1 1 1 1 1 1 1 1
symmnumber: 1
zpe: 650825.2 jmol-1
zpe.correction: 0.247886 hartree
zpe.thermalcorrener: 0.261660 hartree
zpe.thermalcorrenthalpy: 0.262604 hartree
zpe.thermalcorrgfe: 0.206703 hartree
zpe.sumelectzpe: -633.258023 hartree
zpe.sumelectthermal: -633.244250 hartree
zpe.sumelectthermalent: -633.243306 hartree
zpe.sumelectthermalfe: -633.299207 hartree
dipole: -1.3107 3.2053 1.5331
dipole: 3.7871
quadrupole: -83.4608 -87.7795 -91.4386
quadrupole: 8.7461 3.9254 -2.5541
quadrupole: 4.0989 -0.2198 -3.8790 8.7461 3.9254 -2.5541
hfenergy: -633.5059097 hartree
pointgroup: C01 [X(C13H15N1O1)]
dipole: 0.5393178 1.3465849 -0.3403554 debye
polarizability: 193.4860135|-1.5399312|148.154143|8.63017|17.0469858|92.6930382 unknown
InChI: InChI=1S/C13H15NO/c1-10(2)13(15)14-8-7-11-5-3-4-6-12(11)9-14/h3-6H,1,7-9H2,2H3
charge 0 multiplicity 1
30 atoms
O  -2.405535 -1.909475 -0.108994
N  -0.921691 -0.158256 -0.479268
C  -0.588153 1.223306 -0.883253
C  0.525796 1.782306 0.02348
C  0.183016 -1.127879 -0.630652
C  1.709613 0.824171 0.090269
C  1.53442 -0.552562 -0.216224
C  2.996512 1.292037 0.45905
C  2.648089 -1.427099 -0.151356
C  -2.188257 -0.653175 -0.182136
C  4.099601 0.416002 0.52774
C  3.923689 -0.954045 0.219318
C  -3.326257 0.310037 0.0908
C  -4.62796 -0.040649 -0.601206
C  -3.211485 1.305324 1.01143
H  -1.492841 1.846287 -0.839359
H  -0.232249 1.205363 -1.935208
H  0.115649 1.947589 1.040186
H  0.85473 2.769467 -0.353913
H  0.233676 -1.47893 -1.685023
H  -0.075626 -2.014806 -0.026423
H  3.13045 2.356239 0.691101
H  2.510109 -2.489757 -0.388094
H  5.08665 0.795088 0.814758
H  4.772419 -1.644947 0.26915
H  -4.541056 0.076524 -1.69893
H  -5.458691 0.592102 -0.246231
H  -4.870676 -1.101588 -0.412614
H  -4.072066 1.926175 1.286652
H  -2.272577 1.502649 1.541547
