program: Gaussian 09
title: 000260097
version: EM64L-G09RevD.01
frameworkgroup: C1[X(C14H16N2)]
method: RPBEPBE
basis: SDD
operation: Freq
keyword: #pfreq=noraman
keyword: PBEPBE/SDD
title: #p freq=noraman PBEPBE/SDD
converged: YES YES NO NO
title: Mulliken charges:
elementType: N N C C C C C C C C C C C C C C H H H H H H H H H H H H H H H H
charge: -0.449834 -0.449490 -0.092801 -0.428053 -0.038027 0.362228 0.361951 -0.336231 0.478356 -0.458299 -0.458345 -0.492530 -0.492519 -0.691132 -0.207990 -0.208007 0.241483 0.200512 0.200574 0.281895 0.281778 0.213678 0.214035 0.215698 0.215699 0.233339 0.233343 0.206287 0.206335 0.223294 0.216385 0.216389
chargesum: 0.00000
title: Mulliken charges with hydrogens summed into heavy atoms:
elementType: N N C C C C C C C C C C C C C C
charge: -0.167940 -0.167712 0.148682 -0.026967 -0.038027 0.362228 0.361951 0.091482 0.478356 -0.242601 -0.242646 -0.259191 -0.259176 -0.055217 0.008394 0.008382
polarizability: 2.23779910e+02 -3.10062283e-03 1.97016781e+02 1.54462556e+01 6.61722880e-03 9.03231474e+01
1716.lowfreq: -12.6535 -0.0006 -0.0006 -0.0004 2.3655 3.6356 46.1937 57.7165 71.6590
frequency: 46.1305 57.6794 71.5917 152.4857 155.3602 191.1541 214.2008 249.6126 254.5705 272.8294 280.7277 361.2532 417.9317 423.9243 454.5372 468.3368 469.8661 482.5519 502.9689 576.6254 585.4690 631.3145 640.3641 696.5849 718.8274 739.5706 749.5209 756.9580 785.2990 816.2213 822.4863 845.0217 850.1484 865.8716 876.7888 947.5821 956.1836 965.3811 1026.5557 1030.6513 1038.2537 1060.4280 1081.0753 1100.6306 1128.5975 1131.3388 1176.4258 1181.6522 1195.3126 1218.8495 1247.9744 1262.3964 1274.3965 1293.0709 1294.4910 1304.2133 1334.8994 1369.9768 1373.3876 1391.4758 1412.3603 1417.5330 1436.9523 1445.6270 1457.3647 1474.5902 1475.8556 1476.4065 1489.2145 1495.0768 1530.5342 1591.1457 1616.1155 1630.4925 2815.4178 2965.7470 2970.3628 2998.9165 3011.6251 3042.1598 3071.2895 3074.2483 3115.6949 3115.8352 3130.2105 3131.5276 3152.0193 3154.3738 3555.2851 3555.7196
redmass: 4.1760 2.9217 1.7468 4.1835 3.8619 4.1861 1.2812 2.7755 2.2277 3.9844 2.9538 1.3948 2.8696 1.3542 3.0958 4.3062 4.0237 5.2421 4.0604 5.4610 5.7489 3.7922 2.8933 4.6807 5.5835 1.1112 1.3034 1.6369 4.9015 3.2590 2.9562 1.4242 2.5098 1.4658 1.6227 2.0128 1.3142 1.3504 1.7302 3.4824 3.1600 2.7998 1.8347 2.2113 1.8717 2.0989 1.6288 1.5213 1.3223 1.5475 1.4915 1.3768 1.7037 1.2293 1.4937 1.3323 1.4517 1.4833 3.3467 1.2233 1.8102 5.2671 7.0789 2.0128 1.1661 2.3793 1.0457 1.0721 1.1132 1.5924 4.5500 5.3185 7.5183 6.5310 1.0812 1.0582 1.0388 1.0607 1.0992 1.1006 1.1019 1.0986 1.0861 1.0860 1.0907 1.0902 1.0995 1.0987 1.0764 1.0775
irintensity: 0.0105 0.1169 0.0115 0.1081 1.4463 20.0639 0.0258 0.0198 0.0327 14.9390 0.8075 0.0671 52.2446 172.2058 4.3386 1.6323 1.9702 0.0050 0.0211 0.2909 1.8417 3.5818 0.6240 1.9426 34.7426 4.9198 0.2127 98.3206 9.0726 2.4188 76.0290 0.0886 3.8763 0.4707 8.8228 0.1673 0.0189 3.9129 1.1038 12.1940 17.1709 19.4022 0.3378 17.6209 2.2757 30.0152 0.1659 19.7700 0.7232 0.0079 2.7316 27.5848 8.0262 13.7867 0.9888 0.1372 0.2011 0.8143 14.1764 9.0290 25.8017 122.8749 54.7932 1.7984 44.8188 1.3077 4.0435 15.2464 29.4513 49.0989 0.7894 9.2007 444.7722 45.5299 129.7846 28.4389 64.6411 31.4955 14.9999 0.1330 76.9855 44.3776 0.6432 21.9941 19.5971 16.9356 49.5689 26.9393 11.5916 18.0154
temp: 298.150 k
press: 1.00000 atm
elementType: 7 7 6 6 6 6 6 6 6 6 6 6 6 6 6 6 1 1 1 1 1 1 1 1 1 1 1 1 1 1 1 1
symmnumber: 1
zpe: 703880.8 jmol-1
zpe.correction: 0.268094 hartree
zpe.thermalcorrener: 0.281986 hartree
zpe.thermalcorrenthalpy: 0.282930 hartree
zpe.thermalcorrgfe: 0.227587 hartree
zpe.sumelectzpe: -651.460456 hartree
zpe.sumelectthermal: -651.446564 hartree
zpe.sumelectthermalent: -651.445620 hartree
zpe.sumelectthermalfe: -651.500963 hartree
dipole: 3.7074 -0.0024 1.2882
dipole: 3.9249
quadrupole: -87.7294 -84.5230 -100.5711
quadrupole: 0.0004 4.3107 -0.0028
quadrupole: 3.2118 6.4182 -9.6299 0.0004 4.3107 -0.0028
hfenergy: -651.7285504 hartree
pointgroup: C01 [X(C14H16N2)]
dipole: 1.4750944 0.0004843 -0.4566665 debye
polarizability: 224.6793171|-0.0011272|197.0162941|-10.8509732|0.2339323|89.4242271 unknown
InChI: InChI=1S/C14H16N2/c1-2-5-13-15-11-8-3-6-10-7-4-9-12(16-13)14(10)11/h3-4,6-9,13,15-16H,2,5H2,1H3
charge 0 multiplicity 1
32 atoms
N  1.116348 -1.189663 -0.266476
N  1.117171 1.193513 -0.260566
C  1.753927 0.003108 -0.849508
C  3.277804 0.001863 -0.59839
C  -0.999411 0.002164 -0.079321
C  -0.279261 -1.246148 -0.134564
C  -0.278469 1.250245 -0.128837
C  3.692583 -0.005866 0.889484
C  -2.430443 0.002209 0.102578
C  -0.977748 -2.462302 -0.014367
C  -0.97621 2.466289 -0.003201
C  -3.113673 -1.255454 0.204946
C  -3.112902 1.259814 0.210514
C  5.225878 -0.006539 1.06686
C  -2.392847 -2.453704 0.154507
C  -2.391322 2.457836 0.165476
H  1.583851 0.006064 -1.958548
H  3.710223 0.889524 -1.105565
H  3.710045 -0.880731 -1.114441
H  1.626715 -2.069009 -0.35334
H  1.627719 2.073056 -0.344582
H  3.252409 -0.890257 1.387636
H  3.252007 0.873021 1.396901
H  -0.435311 -3.414776 -0.054863
H  -0.433137 3.418583 -0.039247
H  -4.20128 -1.262311 0.336909
H  -4.200511 1.266759 0.342443
H  5.68546 -0.8966 0.595827
H  5.685067 0.889123 0.606175
H  5.503276 -0.012672 2.136593
H  -2.919488 -3.411187 0.24143
H  -2.917372 3.415248 0.256642
