program: Gaussian 09
title: 000260108
version: EM64L-G09RevD.01
frameworkgroup: C1[X(C18H13Cl2NO2)]
method: RPBEPBE
basis: SDD
operation: Freq
keyword: #p
keyword: freq=noraman
keyword: PBEPBE/SDD
title: #p freq=noraman PBEPBE/SDD
converged: YES YES NO NO
title: Mulliken charges:
elementType: Cl Cl O O N C C C C C C C C C C C C C C C C C C H H H H H H H H H H H H H
charge: -0.031039 -0.039300 -0.261929 -0.227325 -0.010248 0.246001 0.348690 0.383628 0.003869 -0.361911 -0.364275 -0.330629 -0.360430 -0.210708 -0.210167 -0.216535 -0.225630 -0.119203 -0.221369 0.153456 -0.256234 -0.215920 -0.666569 0.257023 0.253809 0.254067 0.259713 0.259819 0.262103 0.238713 0.240091 0.235815 0.233298 0.221943 0.233415 0.243970
chargesum: 0.00000
title: Mulliken charges with hydrogens summed into heavy atoms:
elementType: Cl Cl O O N C C C C C C C C C C C C C C C C C C
charge: -0.031039 -0.039300 -0.261929 -0.227325 -0.010248 0.246001 0.348690 0.383628 0.003869 -0.104888 -0.110466 -0.330629 -0.106364 0.049005 0.049652 0.045569 0.013082 -0.119203 0.018722 0.153456 0.212879 -0.215920 0.032759
polarizability: 3.11555177e+02 9.16873443e+00 2.65137156e+02 -1.50714388e+00 2.18944522e+00 1.57579667e+02
1716.lowfreq: -3.5208 -3.3341 -0.0024 -0.0021 -0.0021 7.0674 9.4030 23.5458 37.1155
frequency: 6.7064 23.5048 36.9467 39.9317 51.4050 63.3561 65.8963 82.9857 100.4354 129.4367 133.4207 139.4434 173.5917 189.2430 214.2132 228.2480 246.9348 274.7660 294.7767 310.7131 320.8661 348.5420 391.6375 400.6227 407.9485 436.2731 453.6309 474.4900 488.3843 498.4902 525.3447 540.7863 613.0958 622.3871 656.8336 669.1260 687.4453 718.2037 729.5188 732.4559 756.8274 762.7659 783.7982 816.8398 823.7535 833.5928 868.9857 893.9602 905.3574 955.8321 957.1917 966.7956 991.2837 1000.0178 1009.1359 1022.1092 1040.5827 1074.3228 1084.3518 1095.5448 1118.0840 1127.2391 1155.3101 1175.4916 1184.4925 1192.8050 1203.4971 1264.8728 1278.6077 1294.3651 1304.1099 1354.5055 1362.6449 1363.3674 1389.7743 1400.3620 1419.3836 1456.3236 1459.8841 1462.4098 1475.8094 1483.6338 1546.3175 1566.9924 1570.9249 1593.6444 1599.7460 1615.3498 2168.5296 2993.9247 3032.4759 3089.5068 3096.3475 3122.9243 3139.0598 3148.9003 3149.4724 3158.3141 3165.7986 3174.7854 3178.6188 3179.6184
redmass: 4.9187 7.2412 4.9743 7.0740 5.1138 5.1225 5.0456 4.9478 8.9522 4.0235 7.3954 6.4468 6.4897 3.1420 2.9639 2.5937 8.0998 6.6380 5.8188 4.0687 4.7108 6.4496 5.3840 9.4816 2.9311 4.0186 3.7055 7.9505 4.2758 8.0037 4.5793 7.2694 6.5280 6.8158 6.4050 6.5365 6.3691 4.2958 4.4472 3.6449 3.0299 1.7902 3.0206 1.4304 1.2823 1.5970 1.4530 3.7891 5.4028 1.3654 1.3921 1.3789 1.3420 4.0371 3.0363 6.5361 2.4654 2.7885 4.1309 2.2379 1.4226 1.6751 1.7170 1.0601 4.1002 1.2254 3.6900 1.5079 1.1179 1.8077 2.0394 1.2777 5.2629 7.7419 1.2309 3.8264 2.2187 1.0988 2.4739 1.0460 2.4841 1.0514 10.7804 6.0913 7.4153 6.2243 6.8739 10.2260 12.6409 1.0359 1.0601 1.0976 1.1023 1.1065 1.0864 1.0893 1.0906 1.0886 1.0952 1.0962 1.1001 1.0978
irintensity: 0.4389 1.7824 1.1097 0.2836 0.2573 1.0203 0.0805 0.4899 1.1158 1.7406 1.5712 0.3864 0.3729 2.5716 0.4646 0.6451 1.7741 4.1610 0.1987 19.5814 6.3443 4.4713 3.8754 3.8584 0.7862 2.1799 11.0405 20.8523 15.6528 3.1252 0.4567 4.5362 6.1225 3.1640 3.4065 6.1397 6.4832 2.5667 6.2479 0.6753 40.8423 72.4496 2.0661 2.4026 10.2874 54.2170 1.9017 10.0139 11.7119 0.6503 0.4820 1.6534 0.3622 49.9753 39.3305 49.8132 36.2273 105.8590 269.2110 6.0209 31.5772 8.7952 76.8236 1.4520 66.4712 5.8283 235.2458 3.8786 6.3887 24.5304 26.6627 1.5250 4.0234 6.1188 23.6494 12.2288 22.5765 16.1204 46.8985 14.5229 46.9206 12.3591 150.9549 10.9381 30.8982 87.4233 16.5153 149.7378 16.1048 19.8982 29.3234 36.2195 2.7257 29.2847 0.3072 2.7472 8.5658 2.5038 10.2278 5.1125 13.0135 1.2465
temp: 298.150 k
press: 1.00000 atm
elementType: 17 17 8 8 7 6 6 6 6 6 6 6 6 6 6 6 6 6 6 6 6 6 6 1 1 1 1 1 1 1 1 1 1 1 1 1
symmnumber: 1
zpe: 678182.8 jmol-1
zpe.correction: 0.258306 hartree
zpe.thermalcorrener: 0.280272 hartree
zpe.thermalcorrenthalpy: 0.281216 hartree
zpe.thermalcorrgfe: 0.202822 hartree
zpe.sumelectzpe: -1817.399302 hartree
zpe.sumelectthermal: -1817.377336 hartree
zpe.sumelectthermalent: -1817.376392 hartree
zpe.sumelectthermalfe: -1817.454786 hartree
dipole: -1.7096 -1.4809 -1.1864
dipole: 2.5540
quadrupole: -168.6424 -113.7052 -144.2896
quadrupole: -7.5283 7.7888 0.7031
quadrupole: -26.4300 28.5072 -2.0772 -7.5283 7.7888 0.7031
hfenergy: -1817.6576081 hartree
pointgroup: C01 [X(C18H13Cl2N1O2)]
dipole: 0.1032053 0.7228243 0.6903454 debye
polarizability: 269.784904|-12.2668723|285.1547628|-33.7228336|42.1029854|179.3323328 unknown
InChI: InChI=1S/C18H13Cl2NO2/c1-2-23-18(22)15(11-21)17(12-7-9-13(19)10-8-12)14-5-3-4-6-16(14)20/h3-10H,2H2,1H3
charge 0 multiplicity 1
36 atoms
Cl 1.674612 -0.064519 -3.143654
Cl -3.3926 4.568964 1.690649
O  -1.464216 -3.116865 -0.827302
O  -2.497774 -1.025928 -0.807562
N  1.840259 -3.055333 -0.765223
C  0.292491 0.082129 -0.252449
C  -0.641309 1.143032 0.199759
C  1.72995 0.492887 -0.373912
C  -0.056527 -1.243467 -0.500055
C  -0.47873 2.471063 -0.28694
C  -1.651472 0.895408 1.170904
C  2.472782 0.436393 -1.581905
C  2.401991 0.985083 0.780415
C  -1.32066 3.514735 0.146213
C  -2.483945 1.931422 1.631547
C  3.828021 0.812784 -1.645382
C  3.761053 1.354189 0.739791
C  -2.312823 3.228011 1.103948
C  4.478068 1.262736 -0.475278
C  -1.464026 -1.728581 -0.703126
C  -2.783751 -3.767616 -1.100056
C  0.978308 -2.231303 -0.666465
C  -3.532718 -4.040521 0.207183
H  0.298832 2.685777 -1.027101
H  -1.776963 -0.109826 1.582509
H  1.840721 1.054906 1.718335
H  -1.204497 4.528042 -0.247779
H  -3.251623 1.737726 2.385561
H  4.362498 0.756362 -2.597784
H  4.256994 1.709936 1.648353
H  5.53468 1.546313 -0.520286
H  -3.365725 -3.111909 -1.771244
H  -2.503489 -4.697028 -1.619854
H  -4.455099 -4.611308 -0.007544
H  -2.911904 -4.636115 0.898143
H  -3.820309 -3.097279 0.701086
