program: Gaussian 09
title: 000260082
version: EM64L-G09RevD.01
frameworkgroup: C1[X(C15H13NO4S2)]
method: RPBEPBE
basis: SDD
operation: Freq
keyword: #p
keyword: freq=noraman
keyword: PBEPBE/SDD
title: #p freq=noraman PBEPBE/SDD
converged: YES YES NO NO
title: Mulliken charges:
elementType: S S O O O O N C C C C C C C C C C C C C C C H H H H H H H H H H H H H
charge: 0.274047 0.115438 -0.260464 -0.230621 -0.401964 -0.234462 -0.079073 -0.251448 0.273678 0.305543 -0.456560 -0.198981 0.278898 -0.501854 -0.360229 -0.331255 -0.265152 -0.232753 -0.019337 -0.389223 -0.561037 0.246325 0.248207 0.240963 0.226417 0.240192 0.249942 0.234695 0.231575 0.284370 0.264530 0.226482 0.218035 0.224110 0.390967
chargesum: 0.00000
title: Mulliken charges with hydrogens summed into heavy atoms:
elementType: S S O O O O N C C C C C C C C C C C C C C C
charge: 0.274047 0.115438 -0.260464 -0.230621 -0.010997 -0.234462 -0.079073 -0.251448 0.273678 0.305543 0.032610 0.027436 0.278898 -0.501854 -0.120037 -0.081313 -0.030456 -0.001177 0.265033 0.101789 -0.118892 0.246325
polarizability: 4.05536063e+02 -1.72308935e+01 2.15679898e+02 -2.03053812e+01 4.92129183e-01 1.22614240e+02
1716.lowfreq: -6.5498 -3.1411 -0.0016 0.0011 0.0017 2.2285 23.6166 40.1226 45.8782
frequency: 23.3784 40.1086 45.8746 52.2782 65.1887 68.4383 75.7315 91.9741 97.9119 122.9740 141.9848 168.2787 177.7025 219.7412 236.3681 258.1487 270.3278 293.5969 307.8928 336.0466 377.9105 383.8910 395.6362 410.1288 439.6097 472.6229 481.0174 508.8666 519.7561 527.9320 535.9911 542.0804 571.7376 585.1662 600.2351 683.1155 700.2576 716.6531 736.3664 742.0962 752.9217 767.1809 829.2474 836.6540 845.5070 868.8102 905.2877 906.6792 936.4971 949.2008 957.7493 960.1670 976.2528 983.6955 987.0952 1021.9293 1043.2813 1051.1245 1106.4119 1122.8675 1134.0325 1176.4533 1198.3784 1202.8405 1231.0845 1235.0173 1259.7244 1269.6728 1301.3349 1327.9694 1335.3609 1346.5861 1349.9287 1365.0728 1387.9512 1427.5494 1431.3816 1442.3303 1465.1637 1479.6367 1573.1928 1596.5318 1601.4509 1612.4872 1659.4775 1664.0245 3017.3541 3019.3223 3085.9668 3089.7708 3092.5023 3126.8570 3128.4230 3128.8609 3141.5881 3166.8245 3186.4049 3201.9768 3517.6151
redmass: 5.5752 6.3580 7.0541 5.4819 5.9182 4.8225 5.8983 7.6382 6.7846 4.8940 5.3360 4.0133 6.0765 6.3370 5.6561 6.9766 6.2565 5.0874 5.3667 4.0840 4.5162 3.8614 2.4234 13.3822 2.6870 3.2474 3.2052 4.5355 13.9016 4.8021 3.5033 5.1268 3.4085 1.8468 3.4544 2.6361 4.9124 3.7481 5.7180 6.8890 1.4019 3.3832 3.6437 4.8704 1.7685 1.6061 2.2048 2.9777 1.4856 2.9278 1.3461 2.5474 1.3555 4.1625 3.0173 1.1770 3.9035 2.7481 1.9886 1.9846 2.3041 1.1125 3.1825 2.3148 1.4411 2.0435 2.3143 1.5613 1.2216 2.1684 1.3990 1.7524 1.3263 1.9726 4.5468 1.1728 2.2460 1.1356 1.1156 2.3501 7.0016 8.8824 6.7555 8.6933 4.5266 9.0492 1.0596 1.0640 1.0877 1.0980 1.0642 1.0963 1.0879 1.1002 1.0897 1.0970 1.0948 1.1147 1.0641
irintensity: 0.5137 0.7751 0.5281 2.4210 0.0936 0.4899 1.8792 1.5537 1.7130 1.2601 0.4223 0.7968 0.5335 1.1015 1.8582 4.2647 1.0120 10.4339 3.9138 4.7002 6.0720 3.0058 2.2459 1.6376 1.3658 22.5879 29.4465 3.2459 2.0589 32.9106 12.0685 9.8853 14.6411 72.4359 80.9864 36.1258 43.2604 13.4427 14.5186 16.5343 77.7571 9.0280 11.9703 10.3435 12.4210 20.1821 17.2881 2.7779 1.2498 7.9886 84.8531 47.0263 1.3187 45.5128 30.8263 22.9061 22.6844 42.9393 125.6355 48.6727 119.5632 13.3736 292.7818 112.0182 2.0765 23.3922 58.6390 65.1184 2.9565 26.1041 80.4471 130.2513 4.4066 73.6918 10.9095 12.0672 26.3731 53.1739 39.1748 43.6638 27.9150 103.0432 30.7632 89.4320 9.4301 234.3365 17.1628 43.0467 8.7845 1.2170 7.0852 5.2828 3.9151 3.1749 8.2444 31.5508 10.5107 16.3828 32.3384
temp: 298.150 k
press: 1.00000 atm
elementType: 16 16 8 8 8 8 7 6 6 6 6 6 6 6 6 6 6 6 6 6 6 6 1 1 1 1 1 1 1 1 1 1 1 1 1
symmnumber: 1
zpe: 656819.7 jmol-1
zpe.correction: 0.250169 hartree
zpe.thermalcorrener: 0.271363 hartree
zpe.thermalcorrenthalpy: 0.272307 hartree
zpe.thermalcorrgfe: 0.198134 hartree
zpe.sumelectzpe: -1729.551882 hartree
zpe.sumelectthermal: -1729.530689 hartree
zpe.sumelectthermalent: -1729.529745 hartree
zpe.sumelectthermalfe: -1729.603918 hartree
dipole: 5.5663 1.0962 -0.4972
dipole: 5.6949
quadrupole: -139.3293 -134.0998 -138.8594
quadrupole: -4.5383 2.6318 1.4279
quadrupole: -1.8998 3.3297 -1.4299 -4.5383 2.6318 1.4279
hfenergy: -1729.8020517 hartree
pointgroup: C01 [X(C15H13N1O4S2)]
dipole: 2.0628601 0.577873 -0.6563436 debye
polarizability: 402.6258643|-1.0350986|191.9112251|-38.7154167|-40.0289238|149.2931116 unknown
InChI: InChI=1S/C15H13NO4S2/c1-2-7-16-14(19)12(22-15(16)21)8-10-5-3-4-6-11(10)20-9-13(17)18/h2-6,8,17H,1,7,9H2
charge 0 multiplicity 1
35 atoms
S  -1.690024 -2.337195 1.908419
S  -4.660978 -1.932994 1.150603
O  1.235573 1.001657 0.503174
O  -0.45208 -0.285797 -1.246176
O  1.302703 2.26193 -2.292185
O  -0.717058 2.955205 -1.369336
N  -2.45867 -0.945826 -0.202079
C  -0.396833 -1.572716 0.851989
C  2.120473 -1.215431 0.428732
C  -1.030419 -0.857663 -0.282324
C  -3.287512 -0.272694 -1.244797
C  0.939024 -1.780638 1.095338
C  2.256554 0.158473 0.046052
C  -3.027222 -1.666647 0.842786
C  3.230788 -2.079233 0.204135
C  3.40788 0.602637 -0.644305
C  4.389893 -1.638166 -0.460428
C  4.464398 -0.296227 -0.901207
C  -3.602123 1.170391 -0.891073
C  1.184314 2.413099 0.111914
C  -4.858904 1.615704 -0.648727
C  0.465137 2.581355 -1.227071
H  -2.693226 -0.319081 -2.175586
H  -4.211269 -0.863803 -1.357089
H  1.175927 -2.52008 1.8752
H  3.152514 -3.123223 0.530321
H  3.478628 1.629429 -1.009249
H  5.217943 -2.329847 -0.643145
H  5.34956 0.05822 -1.440346
H  -2.748329 1.860527 -0.869766
H  0.574856 2.894396 0.88999
H  2.189901 2.870916 0.083058
H  -5.053963 2.670353 -0.423541
H  -5.722421 0.939687 -0.659175
H  0.783064 2.24128 -3.141009
