program: Gaussian 09
title: 000260063
version: EM64L-G09RevD.01
frameworkgroup: C1[X(C13H11N3O2)]
method: RPBEPBE
basis: SDD
operation: Freq
keyword: #p
keyword: freq=noraman
keyword: PBEPBE/SDD
title: #p freq=noraman PBEPBE/SDD
converged: YES YES NO NO
title: Mulliken charges:
elementType: O O N N N C C C C C C C C C C C C C H H H H H H H H H H H
charge: -0.302446 -0.307371 -0.340609 -0.305734 -0.065641 0.271288 0.197385 -0.343465 -0.339085 0.030487 -0.219183 -0.236636 0.202180 -0.225653 -0.259799 -0.180167 -0.162958 -0.355920 0.276852 0.214142 0.350281 0.233704 0.232349 0.386051 0.233896 0.281769 0.246300 0.236962 0.251022
chargesum: 0.00000
title: Mulliken charges with hydrogens summed into heavy atoms:
elementType: O O N N N C C C C C C C C C C C C C
charge: -0.302446 -0.307371 0.009671 0.080317 -0.065641 0.271288 0.197385 -0.066612 -0.124942 0.030487 0.014521 -0.004287 0.202180 0.008243 0.021970 0.066133 0.074003 -0.104899
polarizability: 3.18205716e+02 4.27666910e+00 1.73666322e+02 1.79481336e+00 1.51810601e+00 6.51912730e+01
1716.lowfreq: -9.0244 -0.0006 -0.0006 -0.0006 3.4173 3.6314 12.1757 31.6903 46.5324
frequency: 11.8442 31.6725 46.5107 58.8631 111.8493 121.0493 134.5385 180.2795 222.0411 238.2224 291.8923 307.7249 388.5406 399.2206 405.0260 435.8452 454.3105 465.9604 515.5903 589.8928 614.6834 614.8075 663.3451 669.1551 681.7179 691.2767 698.0760 747.7614 759.2732 790.2988 803.6482 809.6716 851.6259 917.5472 930.3589 935.1119 970.4789 970.9555 985.5334 989.2142 1008.2925 1012.7533 1022.9566 1029.4187 1049.0427 1083.9137 1086.9344 1108.8922 1161.1074 1174.1108 1192.6648 1202.4968 1246.0358 1272.2645 1290.5537 1322.5175 1330.6491 1386.6679 1405.6377 1425.9518 1436.2278 1456.6293 1485.0586 1525.8641 1540.9788 1563.3307 1581.7542 1587.0959 1606.4074 1613.5126 3122.5418 3134.2233 3138.7185 3147.4877 3149.9032 3160.0139 3169.5010 3171.3017 3180.4617 3468.1657 3506.2551
redmass: 4.0226 6.3215 5.9568 5.9502 7.8916 6.4203 5.2748 5.4097 6.5998 6.3042 5.7357 8.4569 6.8810 2.8791 3.3217 4.5785 4.6104 4.7194 5.8465 1.2268 6.3037 7.2641 6.6066 4.4716 3.4071 6.7070 1.6831 1.4137 1.3170 2.1640 7.5177 2.3989 1.2562 1.3111 5.5208 1.4696 1.4543 6.9870 1.3925 5.9384 1.3399 1.3425 2.7415 2.4727 2.5316 1.6213 1.6565 2.2922 1.0809 1.0618 1.1670 2.1646 2.6937 2.1552 1.6743 1.4382 5.4105 8.5460 2.3313 2.1220 2.2877 2.7050 2.4393 2.5760 7.1465 6.1863 5.8764 7.6920 7.8536 6.1092 1.0872 1.0873 1.0881 1.0921 1.0907 1.0958 1.0953 1.1009 1.1006 1.0799 1.0783
irintensity: 0.0212 2.8262 2.6234 0.2417 12.4002 2.5643 0.4105 1.0733 1.6433 48.7300 1.1307 0.3183 2.3524 0.3910 3.1584 3.3571 0.6975 0.2504 24.9446 71.5805 2.2555 4.1459 9.1360 28.8968 12.2268 5.3275 84.9046 181.9866 26.0985 15.8567 1.2658 22.3564 0.3602 0.5750 0.1260 4.0300 1.3382 4.6663 0.6423 0.7108 1.1723 0.5032 12.3381 9.0033 7.5009 14.6472 18.9662 1.0560 1.0061 1.1869 5.3405 24.5395 7.9558 55.8786 18.1843 14.9538 5.2140 7.6559 493.2741 208.6882 35.8931 98.2152 44.8958 119.4650 310.2352 2.5158 19.2646 35.9431 0.6018 6.9808 10.5036 1.9060 6.7272 21.1727 13.2487 14.4601 14.7346 24.1671 14.8756 62.0055 79.0668
temp: 298.150 k
press: 1.00000 atm
elementType: 8 8 7 7 7 6 6 6 6 6 6 6 6 6 6 6 6 6 1 1 1 1 1 1 1 1 1 1 1
symmnumber: 1
zpe: 574588.6 jmol-1
zpe.correction: 0.218849 hartree
zpe.thermalcorrener: 0.233912 hartree
zpe.thermalcorrenthalpy: 0.234856 hartree
zpe.thermalcorrgfe: 0.173604 hartree
zpe.sumelectzpe: -815.431608 hartree
zpe.sumelectthermal: -815.416546 hartree
zpe.sumelectthermalent: -815.415602 hartree
zpe.sumelectthermalfe: -815.476854 hartree
dipole: 1.6540 1.0313 -0.0637
dipole: 1.9503
quadrupole: -56.9723 -106.4289 -109.1214
quadrupole: -7.3188 0.8242 1.6414
quadrupole: 33.8685 -15.5880 -18.2805 -7.3188 0.8242 1.6414
hfenergy: -815.6504576 hartree
pointgroup: C01 [X(C13H11N3O2)]
dipole: 0.6529125 -0.4028898 0.0108158 debye
polarizability: 318.1591775|-3.5022832|173.5563044|-4.9917754|3.212765|65.3478295 unknown
InChI: InChI=1S/C13H11N3O2/c17-12(10-6-2-1-3-7-10)15-16-13(18)11-8-4-5-9-14-11/h1-9,15-16H
charge 0 multiplicity 1
29 atoms
O  -1.267052 1.934355 -0.007454
O  1.390327 -2.10264 0.116738
N  -0.616791 -0.273064 0.036646
N  0.718075 0.112168 0.006448
N  3.215938 1.04159 -0.057612
C  -3.020971 0.22784 0.046731
C  -1.600576 0.703113 0.019837
C  -4.02119 1.209749 0.266257
C  -3.405865 -1.126308 -0.145049
C  3.084488 -0.321333 0.013253
C  -5.382169 0.844909 0.308232
C  -4.768873 -1.489048 -0.103371
C  1.686203 -0.859828 0.050219
C  -5.760225 -0.506378 0.126905
C  4.184102 -1.207615 0.051601
C  5.485385 -0.65974 0.014463
C  5.636517 0.744344 -0.059075
C  4.474751 1.554102 -0.092532
H  -3.701609 2.248667 0.397231
H  -2.663842 -1.906695 -0.352103
H  -0.739991 -1.2876 0.113864
H  -6.146715 1.610011 0.480904
H  -5.058008 -2.534334 -0.256506
H  0.921214 1.119492 -0.038923
H  -6.817542 -0.791677 0.158342
H  3.994546 -2.283195 0.108491
H  6.3634 -1.313144 0.042171
H  6.627352 1.207576 -0.089824
H  4.549424 2.645486 -0.148881
