program: Gaussian 09
title: 000260084
version: EM64L-G09RevD.01
frameworkgroup: C1[X(C18H13NO4S2)]
method: RPBEPBE
basis: SDD
operation: Freq
keyword: #p
keyword: freq=noraman
keyword: PBEPBE/SDD
title: #p freq=noraman PBEPBE/SDD
converged: YES YES NO NO
title: Mulliken charges:
elementType: S S O O O O N C C C C C C C C C C C C C C C C C C H H H H H H H H H H H H H
charge: 0.314460 0.136186 -0.276923 -0.208063 -0.411732 -0.195489 -0.236185 -0.295503 0.482770 0.251370 0.333011 -0.181667 -0.586652 0.274688 -0.368148 -0.338678 -0.334378 -0.342020 -0.265459 -0.236391 -0.214952 -0.207045 -0.235651 -0.394070 0.193575 0.251179 0.240746 0.252606 0.261833 0.235038 0.237202 0.234084 0.230607 0.230512 0.231076 0.257016 0.291438 0.389610
chargesum: 0.00000
title: Mulliken charges with hydrogens summed into heavy atoms:
elementType: S S O O O O N C C C C C C C C C C C C C C C C C C
charge: 0.314460 0.136186 -0.276923 -0.208063 -0.022121 -0.195489 -0.236185 -0.295503 0.482770 0.251370 0.333011 0.069512 -0.586652 0.274688 -0.127401 -0.086072 -0.072546 -0.106982 -0.028257 -0.002308 0.015655 0.023467 -0.004575 0.154384 0.193575
polarizability: 4.52318073e+02 -5.89051043e+01 2.88136474e+02 -3.29945026e+00 -1.83829223e+01 1.38292415e+02
1716.lowfreq: -6.5282 -3.7389 -2.6514 -0.0011 0.0008 0.0013 8.4809 22.2121 29.0440
frequency: 8.3563 22.1921 29.0348 33.0841 41.8410 57.5731 64.6187 76.5027 97.2046 102.0781 136.6427 150.3690 175.1521 211.6803 225.9916 251.8484 263.8821 280.8879 298.5457 323.6707 357.6683 387.7191 406.4331 412.1047 431.1692 474.3797 481.1169 488.8811 499.5293 522.7721 525.5133 552.2825 556.5774 578.0642 608.6915 613.7084 622.8618 629.9945 658.8408 689.9092 703.8936 716.6967 740.0589 743.6867 756.1755 783.0822 791.0997 832.0259 839.8435 850.0526 881.3501 919.0054 925.2985 952.5797 970.9307 981.9941 984.1778 990.9136 995.0016 1003.0949 1006.7572 1012.4517 1031.8793 1046.3370 1060.0897 1082.7738 1129.4259 1141.5133 1173.5841 1180.0264 1184.3432 1208.2489 1222.9061 1234.6925 1245.4633 1267.2655 1277.8209 1310.9999 1323.1622 1351.5261 1359.2119 1386.1188 1400.2445 1429.7858 1441.3380 1446.3191 1481.3705 1485.0846 1578.2860 1588.7608 1601.0350 1605.1395 1608.2529 1628.2424 1691.3665 3004.7081 3066.4363 3090.1865 3132.3801 3132.7382 3143.1011 3145.1184 3158.4701 3161.3399 3170.1060 3175.1583 3177.4114 3520.0624
redmass: 9.0506 8.0008 8.3258 6.9804 4.4642 7.8420 6.0040 13.1551 6.0343 6.2582 7.1451 8.0686 5.0766 6.9014 7.6284 7.5744 3.6581 6.2459 5.7136 11.1862 7.2530 6.6686 2.8347 13.9987 5.2886 3.0435 2.2981 3.2704 4.7462 15.9316 5.3057 6.2377 3.8331 6.9691 5.6589 6.4398 2.6480 2.2948 6.1851 2.9380 2.4723 5.9630 3.2711 4.0595 1.2860 2.7828 6.4671 4.4448 1.2545 1.4555 5.0726 1.4804 1.3891 1.4557 1.4129 1.3772 6.8619 6.0588 1.3811 3.3375 3.1051 4.7007 2.3747 2.8132 2.3543 1.5542 1.9934 3.8321 1.0520 1.0802 1.1290 2.1326 5.3899 1.5432 2.4724 1.7207 1.6790 2.4249 2.1357 1.7369 1.5504 10.2053 3.2336 2.0649 2.2611 1.1362 2.3640 2.4063 6.8744 8.7077 6.6396 6.7237 6.2392 8.6310 9.1461 1.0634 1.0851 1.0980 1.0879 1.0853 1.0886 1.0894 1.0940 1.0933 1.0965 1.1005 1.1005 1.0644
irintensity: 0.1958 1.4949 0.6096 0.1401 0.4977 0.5415 2.0341 0.9094 0.3551 0.4006 0.9617 0.5841 0.1216 3.2634 5.5727 2.6811 2.1654 2.6060 0.3448 0.9821 5.6959 1.4655 0.7611 0.6637 1.3342 14.6222 37.6196 16.2932 24.6643 13.1347 28.2542 6.2395 6.3622 38.8602 18.5724 1.8745 38.6325 85.6994 12.6808 17.1908 31.6387 8.9225 16.3571 0.4156 92.5033 25.0464 32.1271 8.4227 0.0161 1.0523 1.5607 2.3588 4.1370 11.2746 0.3895 1.1547 28.1121 8.4984 3.0064 160.1037 109.1136 80.0902 7.6913 76.6541 30.6552 10.3085 52.2495 361.7049 0.1313 11.5951 8.6871 40.9106 303.8621 17.1029 143.0388 10.2016 2.4440 113.9691 72.5360 18.6252 18.3555 2.8032 7.8568 25.9034 5.6904 63.5718 58.8476 60.8604 78.3119 232.2641 14.8026 24.7421 26.3658 56.9393 192.6286 30.3473 0.8705 2.3758 3.3751 0.0088 1.7329 10.9901 39.9190 22.3209 10.8279 29.4956 4.9725 40.1449
temp: 298.150 k
press: 1.00000 atm
elementType: 16 16 8 8 8 8 7 6 6 6 6 6 6 6 6 6 6 6 6 6 6 6 6 6 6 1 1 1 1 1 1 1 1 1 1 1 1 1
symmnumber: 1
zpe: 705852.8 jmol-1
zpe.correction: 0.268845 hartree
zpe.thermalcorrener: 0.291241 hartree
zpe.thermalcorrenthalpy: 0.292185 hartree
zpe.thermalcorrgfe: 0.212552 hartree
zpe.sumelectzpe: -1843.729278 hartree
zpe.sumelectthermal: -1843.706881 hartree
zpe.sumelectthermalent: -1843.705937 hartree
zpe.sumelectthermalfe: -1843.785571 hartree
dipole: 4.5865 -0.3884 -1.4297
dipole: 4.8198
quadrupole: -116.6629 -153.9935 -159.4646
quadrupole: 6.5867 -2.7744 -6.9995
quadrupole: 26.7107 -10.6198 -16.0909 6.5867 -2.7744 -6.9995
hfenergy: -1843.9981227 hartree
pointgroup: C01 [X(C18H13N1O4S2)]
dipole: 1.7555886 0.4028283 0.5928207 debye
polarizability: 448.3832072|67.6996268|263.9646468|3.8592588|-58.1659388|166.3991079 unknown
InChI: InChI=1S/C18H13NO4S2/c20-16(21)11-23-14-9-5-4-6-12(14)10-15-17(22)19(18(24)25-15)13-7-2-1-3-8-13/h1-10,20H,11H2
charge 0 multiplicity 1
38 atoms
S  -0.003596 -1.35484 0.370979
S  -2.507199 -3.128701 0.556736
O  2.517009 -0.466737 0.992775
O  -2.067766 1.821421 -0.747825
O  4.719049 -3.357324 1.557432
O  3.98888 -2.458271 -0.468395
N  -2.448829 -0.434006 -0.121002
C  -0.172512 0.385299 -0.142582
C  -3.890289 -0.323727 -0.264304
C  -1.612201 0.708294 -0.377627
C  2.206044 1.50105 -0.326397
C  0.753888 1.372537 -0.388894
C  -1.814506 -1.624586 0.25379
C  3.118354 0.599235 0.312424
C  2.772903 2.653078 -0.953774
C  -4.433893 0.046736 -1.51341
C  -4.725077 -0.567075 0.84845
C  4.511822 0.822732 0.28766
C  4.158956 2.887751 -0.982057
C  5.030914 1.963322 -0.362253
C  -5.833739 0.171738 -1.64828
C  -6.123555 -0.444949 0.702951
C  -6.680527 -0.076136 -0.543642
C  3.323702 -1.435747 1.705819
C  4.020337 -2.430775 0.773416
H  0.255156 2.285096 -0.756022
H  2.091678 3.364433 -1.435185
H  -3.771683 0.242564 -2.361613
H  -4.285825 -0.851308 1.808947
H  5.203253 0.118904 0.759619
H  4.557021 3.776705 -1.480383
H  6.113703 2.12635 -0.379743
H  -6.25984 0.461197 -2.614676
H  -6.775229 -0.63604 1.562107
H  -7.766463 0.018954 -0.65237
H  4.069512 -0.954927 2.367656
H  2.611987 -1.991735 2.338472
H  5.150958 -4.039012 0.974702
