program: Gaussian 09
title: 000260036
version: EM64L-G09RevD.01
frameworkgroup: C1[X(C8H8N2)]
method: RPBEPBE
basis: SDD
operation: Freq
keyword: #p
keyword: freq=noraman
keyword: PBEPBE/SDD
title: #p freq=noraman PBEPBE/SDD
converged: NO YES NO NO
title: Mulliken charges:
elementType: N N C C C C C C C C H H H H H H H H
charge: -0.423126 -0.423126 0.306910 0.306911 -0.395445 -0.395445 -0.246171 -0.246171 -0.269499 -0.269499 0.313207 0.313207 0.224160 0.224160 0.248803 0.248803 0.241160 0.241160
chargesum: 0.00000
title: Mulliken charges with hydrogens summed into heavy atoms:
elementType: N N C C C C C C C C
charge: -0.109919 -0.109918 0.306910 0.306911 -0.171285 -0.171285 0.002632 0.002632 -0.028339 -0.028339
polarizability: 1.65114410e+02 -2.06248305e+00 9.74335224e+01 -7.22138885e-04 1.36852387e-04 4.05546598e+01
1716.lowfreq: -42.1094 -8.4178 -6.5263 -0.0008 0.0000 0.0005 17.9120 120.8731 143.8111
frequency: -42.1094 120.8731 143.8111 313.0733 384.9379 435.8023 566.2526 568.6852 594.7611 615.0501 635.2482 672.3812 702.1178 707.1504 773.1570 781.2326 859.8574 860.3223 863.0542 870.8219 885.9771 947.0540 1035.7099 1042.8878 1058.8728 1097.0396 1114.3062 1135.6059 1142.9707 1255.9397 1263.6708 1320.2974 1381.4064 1395.0241 1405.8115 1426.3410 1440.4711 1485.6092 1520.5655 1628.1237 3190.5135 3190.7366 3214.3818 3214.5931 3241.7737 3241.8172 3604.9993 3605.0109
redmass: 3.1190 4.7677 3.9354 5.6693 6.3112 4.2094 1.3519 1.3460 2.8035 2.1337 3.4363 2.7074 1.2244 1.2514 1.2981 1.7087 5.7690 1.3329 1.3268 5.6799 4.8645 2.8187 1.3903 1.2858 1.4008 2.0761 1.7629 1.2947 2.7862 1.5680 1.5135 3.0739 2.6966 3.0739 3.4231 5.3724 4.3141 4.4500 2.9474 5.8351 1.0938 1.0936 1.0944 1.0947 1.1074 1.1073 1.0809 1.0809
irintensity: 5.3464 1.2575 2.9743 0.0000 0.0000 0.0000 102.6083 0.0004 5.1823 0.0000 9.1372 0.0000 0.0000 257.2871 128.8843 0.0000 1.5065 0.3530 0.0000 0.0000 15.7919 0.0000 63.4443 0.0000 51.4380 0.0000 49.8223 0.0000 3.0688 10.7480 0.0000 0.0000 7.8200 0.0000 9.9003 5.1037 0.0000 0.0000 43.4741 0.0000 0.0007 20.4005 9.9691 0.0002 4.5222 0.0004 26.7546 50.4214
temp: 298.150 k
press: 1.00000 atm
elementType: 7 7 6 6 6 6 6 6 6 6 1 1 1 1 1 1 1 1
symmnumber: 1
zpe: 376561.1 jmol-1
zpe.correction: 0.143425 hartree
zpe.thermalcorrener: 0.150560 hartree
zpe.thermalcorrenthalpy: 0.151505 hartree
zpe.thermalcorrgfe: 0.111550 hartree
zpe.sumelectzpe: -418.441638 hartree
zpe.sumelectthermal: -418.434502 hartree
zpe.sumelectthermalent: -418.433558 hartree
zpe.sumelectthermalfe: -418.473513 hartree
dipole: 0.0000 0.0000 -0.0011
dipole: 0.0011
quadrupole: -54.7060 -44.9471 -66.1198
quadrupole: 5.6405 -0.0001 0.0000
quadrupole: 0.5516 10.3105 -10.8621 5.6405 -0.0001 0.0000
hfenergy: -418.5850624 hartree
pointgroup: C01 [X(C8H8N2)]
dipole: 0.0000004 -0.0000007 -0.0004296 debye
dipolederiv: 0.0486852 0.2409325 -0.000116 0.1242289 -0.5265933 0.0000309 0.0000093 -0.0000891 -0.2398787 0.0486849 0.240932 0.0001183 0.1242298 -0.526592 -0.0000349 -0.0000186 0.0000799 -0.2398781 0.1631452 -0.0116366 -0.0000054 -0.0464529 0.3050158 -0.0000537 -0.0000725 -0.0000673 0.0283389 0.1631451 -0.011636 0.0000071 -0.046453 0.3050155 0.0000545 0.0000785 0.0000704 0.0283391 0.0281994 0.0091298 0.0000336 0.1572434 -0.0959668 -0.0001095 -0.0000489 -0.0001183 -0.2812997 0.028199 0.0091296 -0.0000385 0.1572425 -0.0959671 0.0001091 0.0000323 0.0001237 -0.2813001 -0.3764243 -0.2408802 0.0000519 -0.0249634 0.1506239 -0.0001194 0.0000997 0.0000037 -0.226072 -0.376424 -0.2408802 -0.0000581 -0.0249639 0.1506237 0.0001262 -0.0000968 0.0000016 -0.2260721 -0.1021013 0.0283477 -0.0000126 -0.2016862 -0.0469957 -0.0000961 0.000091 -0.000052 -0.2468315 -0.1021021 0.0283478 0.0000074 -0.2016855 -0.0469958 0.0000969 -0.0000918 0.0000504 -0.2468318 0.1862802 0.0510317 0.0000003 0.0559132 0.1923132 0.0000491 -0.0000201 0.0000785 0.3269664 0.1862802 0.0510319 0.0000014 0.0559131 0.1923126 -0.0000502 0.0000227 -0.0000784 0.3269661 0.0790806 -0.0946623 0.0000126 -0.0702389 -0.0585517 0.0000928 -0.0000132 0.0001057 0.2047679 0.0790805 -0.0946621 -0.0000102 -0.0702388 -0.0585519 -0.0000922 0.0000175 -0.0001074 0.204768 0.0256753 -0.0608305 0.0000393 -0.0809946 0.0128936 0.0000955 -0.0000634 0.0000533 0.2304951 0.0256754 -0.0608306 -0.0000367 -0.0809947 0.0128935 -0.0000968 0.0000688 -0.0000535 0.2304951 -0.05254 0.0785678 -0.0000379 0.0869504 0.0672611 0.0000585 -0.0000129 0.0000342 0.2035136 -0.0525394 0.0785676 0.0000435 0.0869504 0.0672611 -0.0000607 0.0000183 -0.0000353 0.2035137 unknown
polarizability: 165.1521496|-1.3031298|97.3957826|-0.0007236|0.0001287|40.5546598 unknown
InChI: InChI=1S/C8H8N2/c1-3-7(9-5-1)8-4-2-6-10-8/h1-6,9-10H
charge 0 multiplicity 1
18 atoms
N  1.536254 1.097111 0.000087
N  -1.536254 -1.097099 0.00009
C  0.725155 -0.045126 0.000389
C  -0.725155 0.045137 0.000394
C  1.592261 -1.158913 0.000665
C  -1.592261 1.158924 0.000673
C  2.883433 0.731604 -0.000029
C  -2.883433 -0.731593 -0.000005
C  2.942746 -0.668583 0.000695
C  -2.942747 0.668594 0.000739
H  1.183621 2.052319 -0.000233
H  -1.183621 -2.052308 -0.000239
H  1.294623 -2.208151 0.001016
H  -1.294624 2.208162 0.00102
H  3.677184 1.475677 -0.000376
H  -3.677184 -1.475666 -0.000347
H  3.851175 -1.269318 0.000997
H  -3.851175 1.26933 0.001065
