program: Gaussian 09
title: 000260050
version: EM64L-G09RevD.01
frameworkgroup: C1[X(C12H11BrN2O2S)]
method: RPBEPBE
basis: SDD
operation: Freq
keyword: #p
keyword: freq=noraman
keyword: PBEPBE/SDD
title: #p freq=noraman PBEPBE/SDD
converged: YES YES NO NO
title: Mulliken charges:
elementType: Br S O O N N C C C C C C C C C C C C H H H H H H H H H H H
charge: 0.005329 0.247660 -0.313016 -0.208369 -0.001647 -0.355206 0.351306 0.360632 -0.351013 -0.361680 -0.240915 -0.693076 -0.194578 -0.189570 -0.215041 -0.252378 0.267071 -0.660145 0.221778 0.297227 0.268902 0.249399 0.251960 0.351360 0.238818 0.226169 0.219968 0.226369 0.252685
chargesum: 0.00000
title: Mulliken charges with hydrogens summed into heavy atoms:
elementType: Br S O O N N C C C C C C C C C C C C
charge: 0.005329 0.247660 -0.313016 -0.208369 -0.001647 -0.003847 0.351306 0.360632 -0.129235 -0.064453 -0.240915 -0.424174 0.054822 0.062390 -0.215041 0.212609 0.267071 0.038877
polarizability: 3.16841118e+02 1.68545683e+01 2.08485839e+02 -2.08475730e+00 6.20087177e+00 7.89570736e+01
1716.lowfreq: -6.5510 -1.5603 0.0016 0.0017 0.0021 4.8187 18.1241 28.9159 37.9157
frequency: 17.9127 28.8820 37.9058 43.6919 52.5474 68.7803 104.4907 119.4696 156.5099 179.4898 207.9627 235.6685 257.3881 266.6385 285.4645 308.9760 324.4221 401.4953 408.2531 412.7542 463.0269 487.3622 544.9092 550.4345 610.9559 623.5309 635.8326 663.6458 679.1307 700.9222 709.8045 720.5938 754.2489 793.1426 805.1720 825.7431 855.0729 857.3597 902.5041 926.5588 958.1582 992.9321 996.4630 1019.6919 1042.6695 1062.0553 1094.4642 1110.6685 1132.1778 1157.8663 1169.6919 1190.8515 1201.4492 1281.3898 1292.3742 1307.2432 1356.4007 1366.0270 1390.6878 1397.6617 1455.9405 1457.9063 1462.8422 1483.4089 1488.2385 1518.1983 1573.2238 1593.1575 1609.2370 1690.8109 2993.5109 3030.6682 3089.1630 3094.0278 3120.2067 3139.8247 3157.1458 3170.9498 3175.9412 3245.1933 3553.5437
redmass: 4.2173 3.8007 6.5799 8.4577 5.7285 3.9669 5.8118 5.2246 7.7549 4.5641 2.1528 2.7602 7.2630 6.1639 3.2396 6.5566 4.6703 8.6699 2.9005 3.7021 5.1256 3.4172 5.3142 11.5999 1.3263 7.0125 5.5524 3.9080 7.3839 6.5466 2.1081 5.2071 1.9219 4.6327 1.2625 1.4065 6.1829 1.4416 4.4606 5.3269 1.3717 5.0185 1.3521 3.2926 2.9829 2.3240 2.2038 1.4222 5.4144 1.7402 1.9341 1.1356 1.9970 1.1101 1.5834 2.7751 1.2381 6.4359 1.2327 3.5728 2.6137 1.0875 1.0497 1.0933 1.6512 5.9648 7.7999 7.2735 8.0550 8.5180 1.0361 1.0600 1.0973 1.1031 1.1061 1.0888 1.0889 1.0957 1.0974 1.0953 1.0769
irintensity: 0.9476 0.2440 0.2902 1.7057 1.0985 2.6605 0.3779 0.5330 2.1350 0.8064 5.0857 0.0458 2.1662 6.1903 8.1896 2.3484 10.8144 23.6533 0.0355 5.9580 1.6069 20.0243 2.4265 17.7944 61.0477 0.0620 7.9220 7.7733 1.9550 63.1078 5.7743 51.0009 62.8631 21.5716 3.6380 20.3401 15.7684 35.2685 35.3392 53.6669 0.1410 58.9458 1.5502 201.2109 17.0699 26.2124 89.6778 9.6010 628.1470 1.5898 24.1282 0.9278 23.0942 6.7221 17.2782 13.2731 4.5535 9.2882 30.9283 10.9123 122.5402 14.6192 14.5609 32.9102 578.4675 2.1398 16.2699 244.2525 189.4754 183.7389 18.8089 33.8581 36.6509 0.8339 33.7217 8.8596 1.1253 7.5413 2.5538 5.3682 70.5936
temp: 298.150 k
press: 1.00000 atm
elementType: 35 16 8 8 7 7 6 6 6 6 6 6 6 6 6 6 6 6 1 1 1 1 1 1 1 1 1 1 1
symmnumber: 1
zpe: 548205.0 jmol-1
zpe.correction: 0.208800 hartree
zpe.thermalcorrener: 0.226447 hartree
zpe.thermalcorrenthalpy: 0.227391 hartree
zpe.thermalcorrgfe: 0.158744 hartree
zpe.sumelectzpe: -1134.057656 hartree
zpe.sumelectthermal: -1134.040010 hartree
zpe.sumelectthermalent: -1134.039065 hartree
zpe.sumelectthermalfe: -1134.107713 hartree
dipole: 4.5813 2.0167 0.3024
dipole: 5.0147
quadrupole: -101.0285 -108.5756 -125.4243
quadrupole: -10.2196 -0.2433 0.6882
quadrupole: 10.6476 3.1005 -13.7481 -10.2196 -0.2433 0.6882
hfenergy: -1134.2664567 hartree
pointgroup: C01 [X(C12H11Br1N2O2S1)]
dipole: -1.6200247 1.1173611 0.1394682 debye
polarizability: 305.1591349|-33.591512|217.1211861|-22.2680451|15.9024978|82.003709 unknown
InChI: InChI=1S/C12H11BrN2O2S/c1-2-17-12(16)15-11-14-10(7-18-11)8-3-5-9(13)6-4-8/h3-7,15H,2H2,1H3
charge 0 multiplicity 1
29 atoms
Br 5.893607 -2.325959 -0.674062
S  -0.954414 3.203106 0.454927
O  -4.75014 -0.003312 0.632324
O  -2.787389 -1.289988 0.361272
N  -0.443719 0.579767 0.195684
N  -2.796994 1.093683 0.477912
C  2.01931 0.424859 -0.065116
C  0.80269 1.242133 0.121961
C  3.313755 1.00368 -0.154836
C  1.895933 -0.988214 -0.158614
C  -1.445367 1.405424 0.363085
C  0.732666 2.625677 0.236916
C  4.457417 0.199555 -0.33378
C  3.031894 -1.805053 -0.337581
C  4.302561 -1.200403 -0.423736
C  -5.573437 -1.24928 0.61933
C  -3.364776 -0.192603 0.472479
C  -5.913299 -1.666906 -0.813486
H  3.444757 2.089095 -0.086292
H  0.897732 -1.43073 -0.087877
H  1.535363 3.358299 0.21127
H  5.449827 0.65405 -0.401941
H  2.925743 -2.891256 -0.407792
H  -3.466803 1.85757 0.588741
H  -5.014244 -2.0416 1.147494
H  -6.469494 -0.969267 1.195612
H  -6.590875 -2.540666 -0.794214
H  -6.420867 -0.849404 -1.353984
H  -5.002038 -1.952159 -1.365395
