program: Gaussian 09
title: 000260058
version: EM64L-G09RevD.01
frameworkgroup: C1[X(C17H16ClN3OS)]
method: RPBEPBE
basis: SDD
operation: Freq
keyword: #p
keyword: freq=noraman
keyword: PBEPBE/SDD
title: #p freq=noraman PBEPBE/SDD
converged: YES YES NO NO
title: Mulliken charges:
elementType: Cl S O N N N C C C C C C C C C C C C C C C C C H H H H H H H H H H H H H H H H
charge: -0.070352 0.251600 -0.259778 -0.316517 -0.144386 -0.109614 0.107975 0.341230 0.297748 -0.153985 -0.339169 -0.329715 -0.362851 -0.335524 -0.330277 -0.332350 0.327052 -0.577507 -0.231063 -0.248800 -0.236925 -0.534838 -0.538159 0.258831 0.265948 0.275109 0.252786 0.249118 0.259807 0.270671 0.308180 0.230889 0.228627 0.231275 0.267017 0.325808 0.224701 0.251471 0.225969
chargesum: 0.00000
title: Mulliken charges with hydrogens summed into heavy atoms:
elementType: Cl S O N N N C C C C C C C C C C C C C C C C C
charge: -0.070352 0.251600 -0.259778 -0.316517 -0.144386 -0.109614 0.107975 0.341230 0.297748 -0.153985 -0.080339 -0.063767 -0.087743 -0.082737 -0.081160 -0.072542 0.327052 0.001345 -0.000174 -0.020173 -0.005651 0.057987 0.163982
polarizability: 3.34011534e+02 1.63365711e+00 2.67308339e+02 7.09726563e+00 1.83063195e+01 1.46121285e+02
1716.lowfreq: -6.4094 -5.1138 -0.0018 -0.0016 -0.0015 1.6756 16.8720 23.2783 33.1149
frequency: 16.6969 23.2706 32.9915 43.1760 48.6479 52.5790 85.6254 92.0910 96.4647 103.7394 154.5952 165.8937 190.1133 199.3472 213.5940 236.0350 242.2566 266.3544 293.0286 312.9181 345.8073 400.2633 403.6617 405.0307 419.5426 468.4239 478.1335 504.8743 511.0641 589.0026 605.7488 616.7128 626.8796 634.9439 652.1002 674.0346 688.9297 699.2684 702.6107 732.9679 762.7793 774.8686 777.1348 813.6147 836.8329 854.4790 930.0850 933.5111 945.0700 964.6302 971.0487 977.6070 984.0320 985.3119 986.5592 991.0199 1001.6449 1009.4249 1027.7680 1067.2313 1081.0616 1096.4878 1110.1540 1112.6730 1125.8678 1155.9173 1174.3787 1175.3888 1194.4449 1228.7684 1234.3014 1238.4864 1252.9488 1271.1777 1292.9762 1296.5709 1321.4639 1332.2319 1365.1774 1373.3841 1384.4494 1421.4200 1428.8832 1432.3905 1437.7506 1445.5857 1451.8268 1469.7806 1472.4469 1502.0301 1511.4993 1581.8033 1585.2920 1615.3327 1621.8342 2965.7302 3053.6366 3056.3260 3073.3398 3128.8800 3132.4231 3135.5778 3140.2494 3151.6670 3153.8337 3155.5193 3166.4992 3169.4616 3173.1654 3173.7402 3177.8679
redmass: 11.0165 4.2918 6.2315 6.1864 4.3632 5.1459 2.9861 4.7678 3.9456 5.0106 4.8570 4.4978 3.6735 4.9331 4.2171 4.0386 1.3582 5.3220 9.4045 7.0840 6.2399 5.4742 3.1240 6.1384 2.9627 7.7289 4.8660 4.1856 3.2260 4.4674 6.0323 6.3203 7.4845 9.1075 9.9823 5.3221 5.8720 1.7960 7.0455 4.1378 1.1577 2.9132 2.9372 1.2903 1.6256 1.2488 1.9169 3.2767 1.4293 1.3530 8.3915 1.4232 1.5410 5.7346 6.0956 6.7576 1.3302 2.8154 2.3938 4.6211 1.8618 2.6093 1.3534 1.2591 1.0683 1.3196 1.0556 1.1885 1.1219 3.3215 1.5077 3.0660 5.2432 1.1662 1.2546 1.2782 1.5252 6.5664 4.2800 5.8470 8.3951 3.7726 2.7664 1.1399 1.1934 2.5018 1.0927 1.0517 1.0773 2.6404 3.9294 7.4766 6.1339 6.0403 6.4652 1.0329 1.0583 1.1043 1.0559 1.0851 1.0997 1.1078 1.0892 1.0891 1.0893 1.0938 1.0953 1.1129 1.0958 1.0999 1.0972
irintensity: 0.3258 0.6099 0.3483 0.0572 0.6403 1.5714 2.1549 1.6788 1.1578 2.9269 7.2302 0.4387 4.1094 7.7995 1.8150 5.6948 0.3220 1.2459 1.0451 1.7203 5.3165 2.2325 0.4630 1.5736 0.0965 0.9179 2.9444 5.2232 5.8954 36.0734 21.7443 3.5676 5.2115 108.0271 1.4435 3.0651 1.1155 64.0073 1.6706 4.1162 14.6267 20.1095 26.0898 7.1894 53.7281 1.6814 4.2279 6.6362 1.0152 0.1723 33.9755 0.1219 4.9040 22.5949 3.8948 4.8672 0.4032 3.1433 6.5264 7.3267 13.4170 4.9808 14.4990 0.1529 6.3623 3.1407 0.9899 58.2269 4.1451 102.9176 45.1736 105.3596 40.6809 0.8269 15.8791 1.2105 1.7820 134.3337 19.8756 3.1726 16.3394 11.2027 22.0477 28.8036 15.3799 18.8747 9.8880 18.8416 65.3207 202.8856 10.1491 8.9488 0.7072 5.3910 39.8403 60.4167 6.2595 40.5722 11.5685 0.2649 22.7914 0.5549 11.3606 5.0542 7.2356 26.4277 13.8812 2.5702 6.7088 12.5557 1.2111
temp: 298.150 k
press: 1.00000 atm
elementType: 17 16 8 7 7 7 6 6 6 6 6 6 6 6 6 6 6 6 6 6 6 6 6 1 1 1 1 1 1 1 1 1 1 1 1 1 1 1 1
symmnumber: 1
zpe: 774152.4 jmol-1
zpe.correction: 0.294859 hartree
zpe.thermalcorrener: 0.316480 hartree
zpe.thermalcorrenthalpy: 0.317424 hartree
zpe.thermalcorrgfe: 0.240365 hartree
zpe.sumelectzpe: -1753.332062 hartree
zpe.sumelectthermal: -1753.310441 hartree
zpe.sumelectthermalent: -1753.309497 hartree
zpe.sumelectthermalfe: -1753.386556 hartree
dipole: 7.1407 -4.0618 1.7157
dipole: 8.3923
quadrupole: -152.4416 -143.3054 -141.7241
quadrupole: 3.8134 9.0188 -1.5127
quadrupole: -6.6179 2.5183 4.0996 3.8134 9.0188 -1.5127
hfenergy: -1753.6269211 hartree
pointgroup: C01 [X(C17H16Cl1N3O1S1)]
dipole: -2.0408759 2.5888136 0.186291 debye
polarizability: 326.5999954|-22.7125082|266.0032444|-6.1877477|-36.3101154|154.8379173 unknown
InChI: InChI=1S/C17H16ClN3OS/c1-22-15-9-7-14(8-10-15)21-16(13-5-3-2-4-6-13)19-20-17(21)23-12-11-18/h2-10H,11-12H2,1H3
charge 0 multiplicity 1
39 atoms
Cl 6.72333 -2.148585 1.081678
S  3.271272 0.428555 -0.354822
O  -1.421361 4.759266 -0.905542
N  0.60972 -0.454718 -0.065254
N  0.850402 -2.645086 0.432103
N  2.144316 -2.086416 0.260457
C  -0.064989 -1.660732 0.23864
C  0.077467 0.874677 -0.251991
C  -1.517393 -1.87803 0.327272
C  1.968904 -0.782831 -0.039085
C  -0.482904 1.568808 0.84117
C  0.135259 1.484662 -1.529896
C  -1.972375 -2.999221 1.078344
C  -2.472697 -1.05684 -0.332343
C  -1.00226 2.869255 0.667298
C  -0.370293 2.782687 -1.709517
C  -0.943989 3.478789 -0.61295
C  4.761793 -0.761342 -0.313539
C  -3.348677 -3.281637 1.176708
C  -3.850773 -1.344435 -0.226809
C  -4.296211 -2.452662 0.529018
C  5.116611 -1.137257 1.119876
C  -2.021887 5.532083 0.187598
H  -0.516812 1.089942 1.824978
H  0.573656 0.940958 -2.372611
H  -1.228867 -3.636485 1.566882
H  -2.149525 -0.206255 -0.938768
H  -1.437535 3.389882 1.524689
H  -0.335279 3.277061 -2.684451
H  5.56703 -0.194278 -0.80774
H  4.49246 -1.647306 -0.907479
H  -3.683686 -4.147288 1.758576
H  -4.575496 -0.705289 -0.743085
H  -5.366764 -2.671646 0.608278
H  5.334604 -0.264683 1.75171
H  4.357466 -1.793576 1.565424
H  -2.913726 5.020197 0.597642
H  -2.319159 6.487078 -0.268624
H  -1.28993 5.716495 0.997267
