program: Gaussian 09
title: 000260034
version: EM64L-G09RevD.01
frameworkgroup: C1[X(C8H12O)]
method: RPBEPBE
basis: SDD
operation: Freq
keyword: #pfreq=noraman
keyword: PBEPBE/SDD
title: #p freq=noraman PBEPBE/SDD
converged: NO YES NO NO
title: Mulliken charges:
elementType: O C C C C C C C C H H H H H H H H H H H H
charge: -0.253075 -0.237548 -0.203411 -0.154049 -0.109757 -0.473025 -0.468052 -0.460548 -0.341695 0.253836 0.249450 0.237701 0.243561 0.219300 0.222262 0.221690 0.205360 0.228386 0.212665 0.200105 0.206845
chargesum: 0.00000
title: Mulliken charges with hydrogens summed into heavy atoms:
elementType: O C C C C C C C C
charge: -0.253075 0.016288 0.046039 0.083652 0.133804 -0.031464 -0.041002 -0.019497 0.065256
polarizability: 8.25431407e+01 -3.47522546e+00 7.79698541e+01 -5.02650514e-01 6.28259487e-01 7.30968424e+01
1716.lowfreq: -29.2243 -16.0014 -0.0005 -0.0002 0.0006 9.7175 107.3073 299.3113 346.5576
frequency: 107.0291 299.3006 346.5468 409.1192 427.8914 528.3026 546.9004 692.4929 751.1866 769.2905 780.9931 821.7369 851.7295 858.1304 897.0288 929.5082 941.7383 955.1574 957.5300 962.8199 982.9808 992.7326 1042.3071 1063.4647 1084.3559 1102.1313 1109.3141 1130.8569 1151.4775 1166.8873 1203.8138 1241.1192 1245.9949 1254.8763 1266.5586 1277.0420 1289.6325 1304.2211 1310.3353 1317.0648 1342.6676 1451.4354 1461.4994 1480.0194 1487.0438 2976.4020 2996.9999 2998.4301 3005.5314 3036.8001 3041.5197 3060.1509 3061.8438 3065.9408 3072.7097 3078.7888 3088.0689
redmass: 2.8957 2.6350 2.0659 1.9448 1.8042 4.1340 4.9215 4.2393 4.4691 2.9870 2.5917 3.1313 3.4762 2.7421 1.8860 1.9374 2.3689 1.8186 3.2057 2.0419 1.6337 1.6718 1.6347 1.8713 1.3364 1.1341 1.3206 1.5301 1.2633 1.4624 1.9215 1.6246 1.5481 1.4640 1.5109 1.5039 1.2537 1.5459 1.5720 1.4765 1.3545 1.0856 1.0888 1.1012 1.0873 1.0597 1.0606 1.0630 1.0599 1.1038 1.0908 1.0898 1.1002 1.0908 1.1049 1.1015 1.0936
irintensity: 4.8963 0.5701 2.6480 1.2643 0.2056 1.1826 0.9523 1.7229 0.1814 10.3575 5.3873 2.6977 2.8207 6.5931 1.4512 0.5304 7.5763 5.8506 44.7683 2.8089 5.4517 4.5438 4.1547 23.8189 0.5417 1.5685 4.1647 9.7592 0.3602 0.1707 3.1332 0.5533 6.4378 0.9491 2.5734 3.3511 2.2991 7.7614 1.7203 3.2364 0.4642 10.6927 10.7681 5.9361 2.2081 86.8593 38.7614 36.8623 38.4949 40.7733 31.5571 25.7699 39.3533 64.2039 43.0445 35.7725 41.9554
temp: 298.150 k
press: 1.00000 atm
elementType: 8 6 6 6 6 6 6 6 6 1 1 1 1 1 1 1 1 1 1 1 1
symmnumber: 1
zpe: 484950.8 jmol-1
zpe.correction: 0.184708 hartree
zpe.thermalcorrener: 0.191320 hartree
zpe.thermalcorrenthalpy: 0.192265 hartree
zpe.thermalcorrgfe: 0.153969 hartree
zpe.sumelectzpe: -386.556046 hartree
zpe.sumelectthermal: -386.549433 hartree
zpe.sumelectthermalent: -386.548489 hartree
zpe.sumelectthermalfe: -386.586785 hartree
dipole: -1.6962 -1.4600 0.6656
dipole: 2.3349
quadrupole: -57.6379 -53.7254 -53.5668
quadrupole: -4.4755 0.8866 0.8971
quadrupole: -2.6612 1.2513 1.4099 -4.4755 0.8866 0.8971
hfenergy: -386.7407538 hartree
pointgroup: C01 [X(C8H12O1)]
dipole: -0.6992486 -0.5455498 0.239313 debye
dipolederiv: -0.7012019 0.1415227 -0.0104634 0.1866376 -0.6204259 0.0131616 0.1019762 -0.0228551 -0.3645189 -0.0406664 -0.0033108 0.0731958 -0.0547649 -0.0527728 0.0281395 0.0400492 0.0112328 0.0850898 -0.0449644 -0.0192014 0.0601374 0.0044992 0.0468755 -0.0889817 0.069225 -0.0419731 0.037872 0.1271095 0.00256 0.0348094 -0.0001968 0.0679367 0.000806 0.0465398 0.0047106 0.0718361 0.5815614 -0.1947336 0.0615863 -0.0666123 0.3193338 0.0705652 -0.0251997 0.0837906 0.2794968 0.018273 0.0009899 -0.0432108 0.0021025 0.1492108 0.010207 -0.0114609 0.0074065 -0.0396586 0.0189193 0.0861838 -0.0344476 0.0680658 0.0457541 0.0076417 -0.0456952 0.0110278 0.0420252 -0.0614452 -0.0306046 -0.0814486 -0.0343379 0.03667 -0.0095159 -0.1296863 0.0284769 -0.0584954 0.2731356 -0.0952733 0.002978 -0.2460775 0.5114973 0.0095147 0.0473549 -0.0218061 0.3091751 0.0264871 0.0085944 -0.0947629 0.0062808 0.0544911 0.0117414 -0.072509 0.0067978 -0.1511362 0.0456224 -0.0033865 -0.0216556 0.0141518 -0.1330125 0.0966199 -0.0452432 0.0976334 0.0218056 -0.136822 0.0068329 -0.1280541 0.0048198 0.0527215 -0.0004493 -0.1280811 -0.0009659 -0.0087888 0.0019657 -0.0138979 -0.0276107 -0.0020511 -0.1149281 -0.1044423 -0.0320945 -0.1141255 -0.0043878 -0.0108159 0.0768181 0.0577261 0.1347597 -0.0787327 -0.1119358 0.0497103 -0.0706806 0.0209127 -0.0038365 -0.0745457 0.0483943 -0.1365755 -0.0995539 0.1024141 0.036423 0.0624556 0.0353902 -0.0254661 -0.1181367 -0.0363819 -0.1055246 -0.1392306 -0.0293433 -0.0034367 0.0218357 0.0615662 0.0048771 0.0216425 0.1200608 0.0010458 0.0685019 0.0211275 0.0701256 -0.0298784 -0.1326343 0.0313711 -0.0400373 0.0962123 -0.0152682 0.0674366 0.0075891 0.0640986 0.0515605 -0.10003 -0.0345762 0.1386092 -0.0096831 0.1043862 -0.1310881 -0.0121453 0.0199389 -0.0573104 0.0686355 -0.1054582 0.0729994 -0.1014711 0.0854866 -0.0330649 0.03451 -0.1743245 0.083837 -0.0424688 0.0359308 0.0363748 0.0340894 0.0491729 -0.0176199 -0.0572241 0.1222897 -0.11117 -0.1316862 unknown
polarizability: 82.1394131|-3.6919805|78.3175752|-0.5894377|0.8498026|73.152849 unknown
InChI: InChI=1S/C8H12O/c1-5-2-7-6(1)4-9-8(7)3-5/h5-8H,1-4H2
charge 0 multiplicity 1
21 atoms
O  1.765456 0.770256 -0.167688
C  -0.100532 -0.062236 1.176751
C  0.438879 -1.209465 0.248447
C  -1.499206 0.028616 -0.628514
C  0.430679 1.157074 0.360556
C  -1.628354 -0.060026 0.921098
C  -0.604054 -1.21015 -0.93233
C  -0.640077 1.316324 -0.775919
C  1.842489 -0.717349 -0.149787
H  0.247459 -0.109073 2.219956
H  0.485648 -2.187045 0.758287
H  -2.444499 0.04712 -1.194997
H  0.593241 2.079691 0.940452
H  -2.144046 0.811412 1.364019
H  -2.124116 -0.984466 1.268003
H  -1.210108 -2.134918 -0.923117
H  -0.110578 -1.136825 -1.918551
H  -0.145293 1.416816 -1.757207
H  -1.261565 2.215884 -0.606325
H  2.608636 -1.017848 0.592322
H  2.155844 -1.062091 -1.152857
