program: Gaussian 09
title: 000260033
version: EM64L-G09RevD.01
frameworkgroup: C1[X(C8H11NO)]
method: RPBEPBE
basis: SDD
operation: Freq
keyword: #p
keyword: freq=noraman
keyword: PBEPBE/SDD
title: #p freq=noraman PBEPBE/SDD
converged: NO YES NO NO
title: Mulliken charges:
elementType: O N C C C C C C C C H H H H H H H H H H H
charge: -0.258133 -0.616269 -0.254509 -0.237852 -0.214825 -0.241171 -0.197739 -0.467004 -0.458097 0.169974 0.279890 0.252960 0.253878 0.220766 0.253148 0.213984 0.215180 0.209575 0.226510 0.331681 0.318053
chargesum: 0.00000
title: Mulliken charges with hydrogens summed into heavy atoms:
elementType: O N C C C C C C C C
charge: -0.258133 0.033465 0.025381 0.015107 0.039053 -0.020405 0.055408 -0.037840 -0.022011 0.169974
polarizability: 9.29745163e+01 -6.36832232e-02 8.59637703e+01 3.32151608e+00 -3.02927834e-02 7.26696701e+01
1716.lowfreq: -19.0490 0.0002 0.0005 0.0008 13.1389 22.8829 34.0665 137.8006 180.3596
frequency: 28.2914 137.7628 180.3494 344.6443 387.4993 433.4485 463.7435 494.3938 517.0253 583.2117 635.8221 660.4885 702.5408 795.2594 799.3867 802.7467 871.6381 898.5120 901.5557 911.1017 931.8250 937.3104 981.2865 986.0771 1009.3761 1029.9133 1043.5584 1058.5187 1061.0652 1066.2655 1120.1093 1124.3777 1169.3548 1208.5049 1226.5795 1253.1097 1256.4331 1270.4955 1291.8405 1297.3397 1344.3167 1350.1481 1465.1428 1481.3390 1582.7085 1629.6863 2980.5535 2998.7328 3005.5204 3060.7578 3066.8412 3069.1298 3172.4955 3183.5633 3208.7910 3514.7358 3672.7658
redmass: 4.8829 4.1864 3.8578 3.9689 2.4341 2.0338 2.4111 1.4920 1.5864 2.8044 2.5020 2.5467 3.8000 2.1951 2.1409 2.2214 3.8563 2.2398 2.0829 1.8570 2.2992 2.1529 1.3148 2.7778 1.3369 1.9573 1.3090 1.6729 1.2881 1.3854 1.3675 1.3287 1.8361 1.8778 1.5810 1.4706 1.7129 1.4145 1.7073 1.9407 3.5614 3.0030 1.0949 1.0986 1.6482 2.9099 1.0825 1.0591 1.0596 1.1053 1.0907 1.1057 1.0920 1.0941 1.0992 1.0443 1.1041
irintensity: 9.9837 0.8567 8.8187 0.5354 5.0979 0.6700 1.3520 54.7318 148.9114 16.3761 33.8118 33.5826 1.4422 17.8786 22.2777 15.3469 0.6058 4.7874 2.4163 4.8043 2.8595 2.6693 0.0684 3.8613 1.3929 0.8646 0.8235 0.5231 1.9486 1.1295 0.1392 0.5184 1.0073 3.1177 1.5444 1.4366 0.5763 5.8406 10.2588 30.5100 103.1939 11.5589 7.6768 4.9567 90.6154 281.1157 22.7401 57.6246 32.9864 23.2728 54.7880 44.8590 9.1778 11.9666 9.4268 19.8419 23.2362
temp: 298.150 k
press: 1.00000 atm
elementType: 8 7 6 6 6 6 6 6 6 6 1 1 1 1 1 1 1 1 1 1 1
symmnumber: 1
zpe: 464509.9 jmol-1
zpe.correction: 0.176922 hartree
zpe.thermalcorrener: 0.185114 hartree
zpe.thermalcorrenthalpy: 0.186058 hartree
zpe.thermalcorrgfe: 0.143280 hartree
zpe.sumelectzpe: -440.650916 hartree
zpe.sumelectthermal: -440.642724 hartree
zpe.sumelectthermalent: -440.641780 hartree
zpe.sumelectthermalfe: -440.684558 hartree
dipole: -1.3357 -3.8421 -0.2458
dipole: 4.0751
quadrupole: -59.9383 -58.2437 -58.9506
quadrupole: -10.5971 0.6187 -0.1400
quadrupole: -0.8941 0.8005 0.0936 -10.5971 0.6187 -0.1400
hfenergy: -440.8278381 hartree
pointgroup: C01 [X(C8H11N1O1)]
dipole: 0.4899225 1.4544272 0.4637714 debye
dipolederiv: -0.7236726 -0.274205 -0.0716204 -0.1001713 -0.8996968 -0.2070864 0.0748111 -0.1302712 -0.4164677 -0.6257084 0.4547683 0.0721698 0.3075955 -0.7590114 -0.1039529 0.0427714 -0.1582221 -0.7042595 -0.0628514 -0.0241302 -0.0980346 -0.0664183 0.0152675 -0.0323804 -0.1273777 -0.0634215 -0.0012823 -0.0941042 -0.0760037 0.0720805 -0.0707876 0.0140352 0.0406171 0.0965639 0.0280262 0.0237629 0.0784242 0.0023139 -0.0056005 0.0225832 0.0346564 0.0308012 -0.0049674 0.0401402 -0.1429265 0.021753 -0.0188798 0.0229961 0.001963 0.0949593 -0.0102569 0.0401973 0.00509 0.0310015 -0.1846841 -0.048478 0.0346838 -0.1391937 -0.0360085 -0.0718372 0.133513 -0.0489659 0.1039182 0.000507 0.0534422 0.0879762 0.0560573 0.0609532 -0.0219446 0.0643948 -0.0178507 0.1314817 0.1283876 0.0622988 0.014808 0.0466195 -0.0103272 0.0752064 -0.0008938 0.0554471 0.0217124 1.0701439 -0.0581443 -0.1685053 -0.0214647 1.2775141 0.4420271 -0.3523896 0.4175723 0.3972552 0.0662211 -0.018043 -0.0470952 0.0059736 -0.018682 -0.0718452 -0.0434161 -0.0574063 0.0682551 -0.060181 0.0583118 0.0887653 0.0697345 0.0051748 -0.0351766 0.0855769 -0.0327984 0.0783107 0.0929337 0.0594972 -0.0087736 0.071163 -0.0687144 0.068497 -0.0138323 0.0593089 0.0124463 0.0089734 0.1172711 0.0177794 0.1144094 -0.1495187 -0.0396037 0.0152535 -0.0444746 0.05033 0.0085391 0.0036994 -0.0112595 0.0243301 0.0321915 0.0845515 -0.0474876 0.0759125 -0.0957451 0.074909 0.0132943 -0.0174208 -0.0249509 -0.0097416 0.0981336 0.0341609 0.1288221 -0.1303688 -0.0929967 -0.1009873 -0.0684595 -0.0938849 0.0003005 -0.0354612 -0.1230691 -0.0851337 0.0096605 -0.0405908 -0.0606606 -0.1410486 -0.0517399 0.0282158 -0.099069 -0.0904952 -0.0573328 -0.0584812 -0.0845632 -0.0252325 0.1470138 -0.0373439 0.0514728 0.0101157 0.099228 0.0146517 -0.0020397 0.1620519 -0.032244 0.0474735 -0.0323344 0.1925404 -0.0538297 0.0707696 -0.0595564 0.32498 0.2565085 -0.0878887 0.0320716 -0.0821396 0.144419 -0.0675059 0.0466883 -0.0695374 0.2984564 unknown
polarizability: 93.0611108|1.1929561|84.2688159|-2.7985947|4.4523225|74.2780299 unknown
InChI: InChI=1S/C8H11NO/c9-8(10)6-3-1-4-5(2-3)7(4)6/h3-7H,1-2,9H2
charge 0 multiplicity 1
21 atoms
O  -2.361277 -1.189503 -0.555913
N  -2.512833 0.953905 0.305989
C  0.556873 -0.972089 -0.722836
C  1.995499 -0.428298 -0.576488
C  1.250416 -0.992504 0.658632
C  0.48892 1.159486 0.219114
C  -0.373184 0.254414 -0.733508
C  1.879815 1.104575 -0.491807
C  0.716573 0.217712 1.444391
C  -1.813519 -0.073088 -0.312206
H  0.301136 -1.881616 -1.264531
H  2.857646 -0.928801 -1.020057
H  1.540636 -1.925582 1.143127
H  0.111446 2.172053 0.434682
H  -0.425662 0.701938 -1.747848
H  1.865633 1.590387 -1.48512
H  2.679894 1.562993 0.11803
H  1.456419 0.631289 2.154007
H  -0.21735 -0.00778 1.990179
H  -3.486904 0.79125 0.561918
H  -2.077876 1.847159 0.527546
