program: Gaussian 09
title: 000260123
version: EM64L-G09RevD.01
frameworkgroup: C1[X(C24H25N5O6)]
method: RPBEPBE
basis: SDD
operation: Freq
keyword: #p
keyword: freq=noraman
keyword: PBEPBE/SDD
title: #p freq=noraman PBEPBE/SDD
converged: YES YES NO NO
title: Mulliken charges:
elementType: O O O O O O N N N N N C C C C C C C C C C C C C C C C C C C C C C C C H H H H H H H H H H H H H H H H H H H H H H H H H
charge: -0.268149 -0.261627 -0.299086 -0.318072 -0.196936 -0.193408 -0.438877 0.026637 0.036353 -0.441224 -0.453874 -0.362326 0.413276 0.457895 0.437960 0.005773 -0.367853 -0.387296 -0.415167 -0.413720 -0.493282 0.123751 0.229725 -0.226497 -0.237298 -0.227829 -0.230016 -0.234702 -0.241338 0.257806 0.271976 -0.253620 -0.253507 -0.663871 -0.662286 0.228831 0.371842 0.254220 0.262029 0.236286 0.239739 0.260797 0.229826 0.232141 0.230850 0.229184 0.233050 0.232809 0.386002 0.343131 0.237658 0.223721 0.242345 0.222870 0.215257 0.227770 0.248998 0.218240 0.222020 0.251089
chargesum: 0.00000
title: Mulliken charges with hydrogens summed into heavy atoms:
elementType: O O O O O O N N N N N C C C C C C C C C C C C C C C C C C C C C C C C
charge: -0.268149 -0.261627 -0.299086 -0.318072 -0.196936 -0.193408 -0.067035 0.026637 0.036353 -0.055222 -0.110743 -0.133495 0.413276 0.457895 0.437960 0.005773 -0.113633 -0.125267 -0.178881 -0.173981 -0.232485 0.123751 0.229725 0.003329 -0.005157 0.003021 -0.000832 -0.001652 -0.008528 0.257806 0.271976 0.207759 0.211708 0.028154 0.029063
polarizability: 4.45980602e+02 1.39474328e+01 3.78810313e+02 7.24766439e+00 1.43438372e+01 2.50874017e+02
1716.lowfreq: -8.4797 -3.3251 0.0004 0.0006 0.0008 2.0116 6.1300 14.5364 16.6828
frequency: -5.7780 14.4408 16.5348 26.8135 29.8196 31.0579 34.5447 41.6410 44.7373 50.3948 55.1708 61.0387 71.6336 83.0846 89.9254 95.8284 114.6285 134.1518 146.4699 172.3220 183.2309 203.6659 212.1400 218.8037 229.0381 237.4804 243.0826 253.0939 272.8890 284.1533 287.2765 308.5345 319.3153 335.3805 346.6673 397.4141 401.8161 403.7328 406.8493 427.4906 453.5848 469.0420 475.5128 516.5681 573.1007 580.5068 599.1004 613.4310 615.7554 631.5603 635.7787 641.9959 647.8711 657.8895 668.0607 681.1778 692.8297 703.8616 706.6204 707.8117 716.1705 730.9206 736.1757 750.9377 771.8120 775.1274 775.9932 803.9560 808.1025 809.2552 832.9616 855.3144 857.5940 859.0535 860.7826 868.7761 884.4070 917.7918 930.4245 937.6327 950.0011 980.1885 983.6057 990.6521 991.4808 999.9684 1001.3341 1003.1085 1016.6457 1024.3543 1027.0765 1031.3085 1049.3802 1079.9894 1082.2630 1085.0531 1094.8249 1096.4562 1109.1210 1131.5122 1156.5825 1159.4300 1164.6034 1173.9942 1174.2419 1184.1018 1188.4651 1190.6081 1202.1116 1210.4635 1231.2393 1243.2413 1270.2597 1281.8991 1282.0795 1299.0082 1302.0111 1332.0799 1342.2245 1347.7744 1356.4225 1358.1740 1382.5549 1388.7245 1390.3865 1390.5791 1413.7228 1438.5172 1442.7634 1455.7650 1458.8187 1460.7354 1464.4061 1464.7557 1480.2274 1482.0935 1482.9875 1484.0795 1484.3555 1504.2813 1543.4004 1567.5013 1590.6273 1594.3402 1596.6206 1611.1646 1614.0991 1683.9169 1702.3703 2948.8256 2991.7255 2991.7931 3028.4590 3030.1295 3086.8511 3087.1514 3091.6118 3091.7070 3114.6916 3117.7824 3117.8230 3118.9083 3128.4837 3129.8612 3139.3666 3141.2106 3150.0858 3152.1021 3165.9899 3167.0636 3175.2740 3253.2778 3313.5427 3547.3680
redmass: 3.7296 5.4162 5.9487 4.5594 4.0982 5.1178 5.4930 4.8588 4.1501 5.3196 5.2722 4.5584 5.3007 5.9392 5.3500 4.0578 5.0535 5.5913 4.9564 5.5493 5.3048 1.7543 1.5357 4.2649 4.5014 5.4835 4.0599 2.8789 3.6993 3.5500 4.6948 3.2198 7.8325 5.7430 6.6885 4.8782 2.8084 2.8523 8.0408 3.5836 4.4657 5.3724 3.7319 7.1230 4.3109 5.4766 1.9196 5.8776 6.3154 3.2528 3.5580 7.2207 5.8571 5.1614 6.1561 5.5786 7.0610 2.3158 2.8258 2.0394 4.6271 4.6669 3.4780 2.0064 4.9277 1.9374 1.4042 1.2833 1.2214 1.7887 3.5420 1.2505 4.1627 3.7933 1.2821 3.6320 1.2081 2.3478 1.5840 1.7021 4.3875 1.4008 1.4192 5.6262 5.9719 1.3734 1.3366 4.0220 3.6144 2.5462 2.1897 4.2400 4.5739 3.4474 2.1365 1.7620 2.1987 2.3437 3.5428 2.6779 1.8699 1.7207 2.6669 1.0591 1.0583 1.7250 1.4065 1.1985 3.5439 2.7515 10.1399 2.0447 1.4926 1.1097 1.1087 1.6301 1.7006 1.4330 1.3452 3.7754 1.2397 1.2892 6.8859 5.9608 1.2346 1.2362 3.1954 2.1895 2.1370 1.8861 1.1444 1.4136 1.0462 1.0516 2.7758 2.2946 2.7336 1.0524 1.0578 2.2270 2.6189 3.5624 4.9990 5.8466 5.8786 5.9950 5.9989 8.5081 8.7617 1.0827 1.0360 1.0360 1.0599 1.0597 1.0976 1.0973 1.1030 1.1030 1.0880 1.1059 1.1060 1.0880 1.0860 1.0863 1.0911 1.0913 1.0957 1.0960 1.1014 1.1015 1.0922 1.0792 1.0797 1.0763
irintensity: 0.0323 0.0191 0.2815 0.7122 0.4684 1.9541 0.5962 0.1048 0.1074 0.7991 0.5440 1.8695 0.9366 0.3012 0.6544 0.0921 2.3404 1.0314 1.7327 1.2348 0.2984 0.5405 12.7986 4.0159 0.6426 2.7763 2.5755 1.0601 4.6294 6.1052 4.2562 23.8729 8.5658 8.1535 5.5606 8.6108 0.4356 0.0978 3.7405 1.2709 0.7357 3.7572 5.4925 18.6166 27.0013 11.1570 21.1294 2.4821 0.6956 32.8448 31.8709 6.9764 8.5121 3.1549 6.0589 15.1966 16.5389 15.5112 71.3501 43.0384 14.5332 13.7644 16.5897 56.0948 27.9434 30.1336 58.2199 4.9452 4.2069 31.4188 14.2116 0.1553 2.6388 16.8415 0.4580 3.8303 115.8588 28.6393 24.4191 8.2715 97.4378 0.0332 0.0350 1.5872 2.5270 0.6651 1.8671 27.9059 40.2424 65.2444 13.2116 106.2270 303.0383 603.1605 224.8057 92.0225 110.6475 14.6358 146.5831 267.9956 47.4350 4.4858 26.4342 0.3739 0.0225 21.4365 2.3899 7.9948 224.7017 8.3931 687.4281 192.6650 11.3421 4.3894 4.5352 13.2446 18.4468 6.0075 0.9840 182.7166 11.8488 6.1234 7.6575 5.8728 39.8167 29.3790 346.9119 23.6107 19.3616 121.9400 60.8062 57.2489 13.0582 11.9407 142.2362 31.2119 100.7752 10.5826 12.9254 686.9122 167.2006 1176.6681 539.2964 110.3490 105.6755 11.3788 5.6676 196.4668 230.7569 16.5463 30.0762 15.5743 37.5111 34.9951 32.9426 49.8406 0.7241 2.3550 7.0051 62.4017 4.3403 8.0622 0.3078 0.0305 9.8532 12.7572 27.3981 29.1197 26.2409 25.0427 3.0930 119.5067 119.3880 47.3579
temp: 298.150 k
press: 1.00000 atm
elementType: 8 8 8 8 8 8 7 7 7 7 7 6 6 6 6 6 6 6 6 6 6 6 6 6 6 6 6 6 6 6 6 6 6 6 6 1 1 1 1 1 1 1 1 1 1 1 1 1 1 1 1 1 1 1 1 1 1 1 1 1
symmnumber: 1
zpe: 1214662.8 jmol-1
zpe.correction: 0.462641 hartree
zpe.thermalcorrener: 0.494997 hartree
zpe.thermalcorrenthalpy: 0.495941 hartree
zpe.thermalcorrgfe: 0.393455 hartree
zpe.sumelectzpe: -1652.089017 hartree
zpe.sumelectthermal: -1652.056661 hartree
zpe.sumelectthermalent: -1652.055717 hartree
zpe.sumelectthermalfe: -1652.158203 hartree
dipole: -3.8671 5.1068 0.2788
dipole: 6.4119
quadrupole: -181.8018 -194.1842 -191.1817
quadrupole: -5.0002 3.7485 -2.4993
quadrupole: 7.2541 -5.1283 -2.1258 -5.0002 3.7485 -2.4993
hfenergy: -1652.5516581 hartree
pointgroup: C01 [X(C24H25N5O6)]
dipole: -1.5593857 -1.958726 -0.30878 debye
polarizability: 445.5556517|-15.0241726|375.7927447|-5.6349627|25.568051|254.3165369 unknown
InChI: InChI=1S/C24H25N5O6/c1-3-34-23(30)27-19-15-18(21(29(32)33)22(26-19)28-24(31)35-4-2)25-20(16-11-7-5-8-12-16)17-13-9-6-10-14-17/h5-15,20,25,27-28H,3-4H2,1-2H3
charge 0 multiplicity 1
60 atoms
O  -1.069568 3.272409 0.42586
O  1.11177 3.847813 0.619461
O  4.955017 3.107654 0.428743
O  2.961552 -4.368503 -0.026579
O  4.936042 0.908391 -0.410323
O  3.991966 -2.507929 0.995376
N  -1.799938 0.79867 0.304914
N  2.332959 -0.182653 0.253724
N  0.196613 2.917301 0.4677
N  2.969597 2.071899 0.330069
N  1.762034 -2.475492 0.12639
C  -2.884331 -0.20492 0.363534
C  -4.154923 0.498175 0.871727
C  -3.09787 -0.9561 -0.961451
C  -0.461872 0.497182 0.276005
C  0.564329 1.53655 0.356613
C  -5.110505 1.046031 -0.017961
C  -2.679393 -0.42253 -2.20305
C  -4.349238 0.641816 2.268726
C  -3.757935 -2.21057 -0.9381
C  -0.021384 -0.851296 0.193872
C  1.964212 1.113627 0.313444
C  1.361134 -1.131835 0.204825
C  -6.240696 1.730732 0.482758
C  -2.917823 -1.13025 -3.403573
C  -5.480241 1.321648 2.770728
C  -3.99809 -2.918964 -2.135387
C  -6.429212 1.870184 1.876776
C  -3.577648 -2.379864 -3.374492
C  4.340836 1.890592 0.067816
C  3.018409 -3.029402 0.425923
C  6.415203 3.195503 0.142416
C  4.170689 -5.190031 0.268027
C  6.665578 3.63251 -1.303979
C  4.09796 -5.793539 1.673537
H  -2.605122 -0.957777 1.13251
H  -2.023714 1.80633 0.370734
H  -4.976698 0.928181 -1.09877
H  -2.158676 0.541028 -2.227897
H  -3.60984 0.224834 2.964105
H  -4.093966 -2.628977 0.019452
H  -0.748178 -1.661864 0.119387
H  -6.973531 2.152503 -0.213907
H  -2.585273 -0.707869 -4.358299
H  -5.620481 1.425138 3.85226
H  -4.509573 -3.88747 -2.103651
H  -7.307318 2.399167 2.263357
H  -3.75992 -2.929257 -4.304658
H  2.642166 3.038637 0.520819
H  1.067234 -3.15648 -0.188031
H  6.873689 2.212491 0.349755
H  6.774018 3.942151 0.868747
H  5.062947 -4.550041 0.152356
H  4.155008 -5.962651 -0.517313
H  7.749813 3.77784 -1.467252
H  6.152405 4.585182 -1.521596
H  6.31174 2.863796 -2.011515
H  4.964658 -6.460671 1.837681
H  3.176448 -6.387601 1.802131
H  4.125933 -5.001328 2.440526
