program: Gaussian 09
title: 000260128
version: EM64L-G09RevD.01
frameworkgroup: C1[X(C21H19ClN4O4)]
method: RPBEPBE
basis: SDD
operation: Freq
keyword: #p
keyword: freq=noraman
keyword: PBEPBE/SDD
title: #p freq=noraman PBEPBE/SDD
converged: YES YES NO NO
title: Mulliken charges:
elementType: Cl O O O O N N N N C C C C C C C C C C C C C C C C C C C C C H H H H H H H H H H H H H H H H H H H
charge: 0.054705 -0.265872 -0.173780 -0.320047 -0.194143 -0.436803 0.094156 0.021160 -0.439886 -0.345468 0.454211 0.386001 0.421088 -0.382510 -0.398838 -0.419926 -0.368792 0.293179 -0.450353 -0.238609 -0.229006 -0.231008 -0.230305 0.190876 -0.240343 -0.232335 -0.439364 0.272709 -0.252627 -0.661392 0.228020 0.375321 0.260811 0.240022 0.240724 0.255319 0.260813 0.233876 0.231923 0.230447 0.230632 0.233739 0.233955 0.346069 0.223761 0.238522 0.218970 0.224453 0.255943
chargesum: 0.00000
title: Mulliken charges with hydrogens summed into heavy atoms:
elementType: Cl O O O O N N N N C C C C C C C C C C C C C C C C C C C C C
charge: 0.054705 -0.265872 -0.173780 -0.320047 -0.194143 -0.061482 0.094156 0.021160 -0.093818 -0.117448 0.454211 0.386001 0.421088 -0.121699 -0.158816 -0.179203 -0.113473 0.293179 -0.189539 -0.004732 0.002917 -0.000561 0.000327 0.190876 -0.006604 0.001620 -0.439364 0.272709 0.209656 0.037974
polarizability: 3.83598668e+02 2.12467730e+01 3.15215593e+02 -3.36072452e+00 4.80091886e+00 2.15685133e+02
1716.lowfreq: -15.3233 -5.8434 -3.5387 -0.0017 -0.0014 -0.0004 4.4487 15.4764 18.4015
frequency: -14.5208 15.2937 18.2215 26.3411 35.7156 39.6565 44.6296 54.6926 58.1323 64.1427 75.3135 81.8025 106.2115 132.5821 173.1891 181.3850 188.4816 203.6302 223.0223 230.8572 233.4958 250.1554 262.8500 275.8703 282.9039 302.9824 315.1064 361.0240 401.8987 402.7650 404.3173 408.0012 455.0078 466.4956 475.8073 521.8261 570.2052 584.6567 592.4198 613.7982 616.1023 622.6683 645.5228 653.5110 657.5146 661.5574 688.8627 705.6313 707.3650 711.8596 714.7751 733.4895 750.1440 766.8919 768.6379 775.6707 804.3979 821.5820 835.2526 836.6526 856.3801 860.7106 864.0291 902.0175 918.1360 930.2250 940.8396 981.6486 984.2370 985.5505 990.5128 991.4180 1000.7018 1002.0867 1023.5285 1028.0975 1030.4957 1057.4828 1079.6605 1085.7190 1094.4087 1099.0126 1128.9876 1158.9891 1171.5249 1174.6482 1174.8252 1185.9748 1189.1838 1192.2249 1212.2594 1237.0257 1262.1173 1279.4924 1279.8907 1300.8397 1306.0477 1331.5924 1345.2399 1353.2492 1372.6154 1382.4644 1389.5867 1391.7934 1409.5138 1434.6155 1438.4038 1443.9231 1455.8408 1458.8830 1463.8846 1482.3040 1483.4361 1484.8308 1528.8084 1562.9223 1590.6892 1594.3991 1597.4485 1611.9307 1614.4819 1700.4964 2935.3485 2993.1546 3028.3750 3088.4840 3093.2512 3114.7050 3118.5036 3119.0460 3129.2435 3130.7388 3139.7212 3142.8037 3150.5584 3153.6118 3166.4808 3167.7132 3177.2051 3334.0031 3545.2446
redmass: 3.7017 5.2438 3.8740 7.5163 6.7938 6.5186 4.0136 6.2075 6.0393 6.5101 7.8585 4.1584 5.8089 5.5843 6.4906 4.7255 4.2195 2.2586 5.6932 5.3385 4.2116 3.4300 4.9157 6.4237 5.0261 8.0456 3.6947 11.7714 2.8381 5.7883 2.8293 7.0357 4.4015 5.4684 3.7993 6.7918 5.6387 4.7359 4.1850 6.3869 6.3877 4.3618 3.2863 6.5129 2.5728 5.0171 6.5456 1.7437 1.9280 4.8481 3.7499 2.5326 2.0401 2.6530 2.0176 2.2093 1.2058 2.4462 4.1175 2.8017 1.2482 1.2658 3.7301 5.7987 2.6021 1.5179 1.8145 1.4092 1.4277 3.7888 5.7144 6.0009 1.3256 1.3233 2.5740 2.2021 4.0947 3.9415 2.6528 1.6438 2.1866 2.6102 3.0887 1.7329 3.8332 1.1510 1.0602 1.4957 1.7564 1.1150 2.7891 1.9703 1.5924 1.4841 1.6385 1.3564 4.3882 1.2727 1.3263 1.2482 9.1753 7.1152 5.6402 1.2367 4.5852 3.0470 2.1971 2.1390 1.4867 1.7668 1.0488 2.2674 2.2613 1.0519 2.9325 2.8800 6.6200 6.2419 6.0889 5.9723 6.0253 8.4516 1.0821 1.0361 1.0601 1.0974 1.1032 1.0881 1.0882 1.1057 1.0860 1.0863 1.0911 1.0914 1.0958 1.0957 1.1014 1.1015 1.0919 1.0790 1.0762
irintensity: 0.7399 0.1463 0.1939 0.0724 0.0928 0.3853 0.0072 1.3898 1.6815 0.7238 0.8525 0.6225 1.1107 0.7224 0.1120 1.7807 3.0237 4.2450 1.5906 0.5722 1.8407 0.8141 0.6826 2.8324 2.4685 6.9099 19.8219 5.1671 0.3831 6.8178 0.0904 9.6500 1.5675 3.8057 4.2650 8.7673 10.5351 42.1740 3.8299 0.1850 0.8073 8.4471 13.7936 6.3391 13.4163 1.0414 15.8223 63.2979 27.2050 25.5871 39.8793 38.5370 58.3503 35.3912 40.1033 25.8886 1.0661 25.9476 37.2884 24.8743 0.4042 0.2833 0.6957 33.4163 37.7846 18.9793 12.1933 0.6184 0.3342 33.7498 0.8864 2.8597 1.3024 0.3772 18.9251 17.8482 172.4359 209.3635 411.3141 48.7338 101.0647 63.5845 242.1161 8.1834 238.6493 30.5334 1.8055 33.2514 9.8022 8.6409 19.7049 34.3701 66.1709 15.1195 51.9830 38.0163 168.5801 17.5579 14.7762 11.9934 21.6923 1.8305 12.7726 42.4537 325.6636 130.6261 15.7670 18.1723 129.8517 103.1851 17.6304 8.8838 19.2720 15.3141 483.4270 450.3983 719.6364 123.2808 217.5653 17.2187 4.8124 218.1332 18.4415 20.2953 36.9443 40.2410 0.7976 6.9381 8.4389 31.9599 0.3271 0.0426 9.1582 13.7119 26.8669 25.3362 24.3296 23.4759 3.6080 110.1008 44.3290
temp: 298.150 k
press: 1.00000 atm
elementType: 17 8 8 8 8 7 7 7 7 6 6 6 6 6 6 6 6 6 6 6 6 6 6 6 6 6 6 6 6 6 1 1 1 1 1 1 1 1 1 1 1 1 1 1 1 1 1 1 1
symmnumber: 1
zpe: 964342.4 jmol-1
zpe.correction: 0.367299 hartree
zpe.thermalcorrener: 0.393930 hartree
zpe.thermalcorrenthalpy: 0.394874 hartree
zpe.thermalcorrgfe: 0.306011 hartree
zpe.sumelectzpe: -1789.390637 hartree
zpe.sumelectthermal: -1789.364006 hartree
zpe.sumelectthermalent: -1789.363061 hartree
zpe.sumelectthermalfe: -1789.451925 hartree
dipole: 2.2696 -9.2152 -2.2616
dipole: 9.7563
quadrupole: -165.5394 -191.8515 -172.0551
quadrupole: 14.9584 -1.9163 -9.6819
quadrupole: 10.9426 -15.3695 4.4269 14.9584 -1.9163 -9.6819
hfenergy: -1789.7579357 hartree
pointgroup: C01 [X(C21H19Cl1N4O4)]
dipole: 0.9117849 3.6386446 0.8139525 debye
polarizability: 383.2649496|-21.6260057|315.6606896|4.8845458|2.4082978|215.5737548 unknown
InChI: InChI=1S/C21H19ClN4O4/c1-2-30-21(27)25-17-13-16(19(26(28)29)20(22)24-17)23-18(14-9-5-3-6-10-14)15-11-7-4-8-12-15/h3-13,18,23,25H,2H2,1H3
charge 0 multiplicity 1
49 atoms
Cl -2.706435 -4.121676 -0.31342
O  1.624247 -3.256734 -0.470291
O  -0.110235 -4.205901 -1.593202
O  -5.046208 2.042037 1.043866
O  -5.390597 -0.28048 0.810698
N  1.345696 -0.748267 0.195789
N  -2.808345 -1.520921 0.200531
N  0.34759 -3.307377 -0.796755
N  -3.236094 0.765138 0.705485
C  1.951662 0.535783 0.615375
C  1.734627 1.672025 -0.394594
C  3.433272 0.273932 0.94057
C  -0.00168 -0.99273 0.154449
C  1.535542 1.420512 -1.772684
C  3.75676 -0.359016 2.168339
C  1.767035 3.01298 0.063848
C  4.474224 0.609652 0.04262
C  -0.537522 -2.288221 -0.254972
C  -0.946084 0.021782 0.489084
C  1.372148 2.49255 -2.679557
C  5.098285 -0.653585 2.493425
C  1.605867 4.08587 -0.839895
C  5.81822 0.315107 0.367074
C  -2.323565 -0.268844 0.45819
C  1.407118 3.827993 -2.217072
C  6.134311 -0.316491 1.591007
C  -1.94859 -2.476275 -0.133416
C  -4.634454 0.705666 0.840276
C  -6.519343 2.242008 1.17685
C  -7.187357 2.331426 -0.197897
H  1.465615 0.841426 1.568651
H  1.949558 -1.572704 0.041762
H  1.503453 0.386398 -2.133013
H  2.955173 -0.62607 2.868592
H  1.930515 3.217682 1.129839
H  4.23762 1.106596 -0.904074
H  -0.600581 1.025885 0.741478
H  1.215994 2.284863 -3.7439
H  5.335286 -1.143145 3.444276
H  1.633909 5.118014 -0.473283
H  6.616438 0.578687 -0.335462
H  1.278667 4.658441 -2.919965
H  7.176638 -0.543349 1.840741
H  -2.853032 1.708314 0.803451
H  -6.600178 3.18442 1.741604
H  -6.93321 1.407277 1.769798
H  -8.262289 2.560093 -0.074658
H  -6.73209 3.131148 -0.807307
H  -7.100486 1.37348 -0.737248
