program: Gaussian 09
title: 000260028
version: EM64L-G09RevD.01
frameworkgroup: C1[X(C5H2Cl2O2)]
method: RPBEPBE
basis: SDD
operation: Freq
keyword: #p
keyword: freq=noraman
keyword: PBEPBE/SDD
title: #p freq=noraman PBEPBE/SDD
converged: NO NO NO NO
title: Mulliken charges:
elementType: Cl Cl O O C C C C C H H
charge: 0.117246 0.054450 -0.254291 -0.152973 0.640683 -0.250281 -0.283193 0.135411 -0.566044 0.278099 0.280893
chargesum: 0.00000
title: Mulliken charges with hydrogens summed into heavy atoms:
elementType: Cl Cl O O C C C C C
charge: 0.117246 0.054450 -0.254291 -0.152973 0.640683 0.027818 -0.002300 0.135411 -0.566044
polarizability: 1.49459542e+02 -1.58570523e+00 8.39726610e+01 6.12794408e-04 -7.01076560e-04 2.90844212e+01
1716.lowfreq: -0.0027 -0.0023 -0.0015 3.7834 7.7393 8.4230 91.1126 124.6019 125.4461
frequency: 91.1090 124.6005 125.4422 233.0029 274.3033 334.3896 391.0812 396.5643 498.7936 597.5751 659.4717 691.9038 732.9871 799.4319 807.4643 877.6875 930.9138 937.1348 1036.3705 1083.4001 1219.8228 1319.2997 1542.9666 1628.8373 1722.0023 3216.9257 3243.8047
redmass: 9.0184 15.0444 8.9545 18.4491 6.1653 16.0857 7.1555 16.9556 6.2401 4.3589 10.4179 5.4403 9.0569 9.8017 1.4913 11.9043 8.2302 1.3241 2.3010 1.3963 3.5673 2.1248 6.4742 11.2390 12.4292 1.0912 1.1074
irintensity: 5.3215 1.6540 2.1604 0.5065 0.4401 1.2894 1.3813 9.7738 0.3334 0.0120 5.7717 0.0014 61.4027 74.6507 79.8831 156.6641 62.1968 0.5835 49.8727 2.0354 56.1965 0.3225 39.5347 81.8130 512.2733 1.7526 0.2472
temp: 298.150 k
press: 1.00000 atm
elementType: 17 17 8 8 6 6 6 6 6 1 1
symmnumber: 1
zpe: 152627.3 jmol-1
zpe.correction: 0.058133 hartree
zpe.thermalcorrener: 0.066201 hartree
zpe.thermalcorrenthalpy: 0.067145 hartree
zpe.thermalcorrgfe: 0.023939 hartree
zpe.sumelectzpe: -1261.610554 hartree
zpe.sumelectthermal: -1261.602486 hartree
zpe.sumelectthermalent: -1261.601542 hartree
zpe.sumelectthermalfe: -1261.644748 hartree
dipole: -1.8177 -3.8555 -0.0002
dipole: 4.2624
quadrupole: -72.8691 -60.8585 -64.7859
quadrupole: -9.0341 -0.0005 -0.0007
quadrupole: -6.6979 5.3127 1.3852 -9.0341 -0.0005 -0.0007
hfenergy: -1261.6686865 hartree
pointgroup: C01 [X(C5H2Cl2O2)]
dipole: 0.731486 -1.5090295 0.000072 debye
dipolederiv: -0.2527064 -0.1931 -0.0000047 -0.4217994 -0.6543217 -0.0000133 -0.0000314 -0.0000288 0.0799367 -0.505054 0.2359102 0.0000043 0.4829565 -0.4537324 -0.0000111 -0.0000165 -0.000001 0.0433689 -1.1124157 0.0974143 -0.0000371 -0.0959488 -0.4672991 -0.0000311 0.0000771 -0.0000047 -0.1941776 -1.2995689 0.1938229 0.0000912 0.6545129 -0.5107739 -0.0000622 -0.0002307 0.0000551 -0.3012077 -0.1884528 -0.2344705 0.000032 -0.7878529 -0.0981058 0.0000123 -0.0000434 -0.0000033 0.1783023 0.6460548 0.0587405 -0.0000276 0.3881446 0.1066826 0.0000063 -0.0000166 -0.0000094 -0.1158913 -0.5252938 0.0519115 0.0000221 0.5630576 -0.1761538 0.00002 0.0000199 -0.0000197 -0.158778 1.8791901 -0.2830596 -0.0000709 -0.768653 0.7908466 0.0000854 0.0001069 0.0000015 0.27757 1.1912847 0.0590745 -0.0000104 -0.0080755 1.3530104 0.000024 0.0000831 0.000037 -0.1883156 0.0931024 0.0683254 0.0000046 0.0191414 0.0454218 -0.0000143 0.0000313 -0.0000029 0.181722 0.0738596 -0.0545692 -0.0000036 -0.0254834 0.0644253 -0.000016 0.0000202 -0.0000239 0.1974703 unknown
polarizability: 149.4175738|2.2937035|84.0146293|0.0006052|0.0007077|29.0844212 unknown
InChI: InChI=1S/C5H2Cl2O2/c6-5(7)3-1-2-4(8)9-3/h1-2H
charge 0 multiplicity 1
11 atoms
Cl 2.341351 1.821281 0.000021
Cl 2.955313 -1.149078 -0.000029
O  -0.581789 0.89276 0.000029
O  -2.950433 0.900485 -0.000084
C  0.383406 -0.135158 0.000001
C  -0.283977 -1.434693 -0.000002
C  -1.640113 -1.220853 -0.000047
C  -1.910609 0.232178 0.000186
C  1.720135 0.155789 -0.000029
H  0.244128 -2.387232 -0.000079
H  -2.441012 -1.958079 -0.000165
