program: Gaussian 09
title: 000260054
version: EM64L-G09RevD.01
frameworkgroup: C1[X(C17H18Cl2N4O)]
method: RPBEPBE
basis: SDD
operation: Freq
keyword: #p
keyword: freq=noraman
keyword: PBEPBE/SDD
title: #p freq=noraman PBEPBE/SDD
converged: YES YES NO NO
title: Mulliken charges:
elementType: Cl Cl O N N N N C C C C C C C C C C C C C C C C C H H H H H H H H H H H H H H H H H H
charge: -0.051094 -0.053550 -0.228384 -0.167151 0.051105 -0.410847 -0.002592 -0.390797 -0.391874 0.456065 -0.350162 -0.365876 -0.583720 -0.584346 0.474567 -0.403664 -0.419840 -0.393331 0.230463 0.181141 -0.257997 -0.448434 -0.176713 -0.325395 0.249710 0.253468 0.250725 0.251063 0.235748 0.234425 0.268369 0.294387 0.270209 0.293249 0.282402 0.224030 0.205086 0.290188 0.283875 0.239101 0.237842 0.248547
chargesum: 0.00000
title: Mulliken charges with hydrogens summed into heavy atoms:
elementType: Cl Cl O N N N N C C C C C C C C C C C C C C C C C
charge: -0.051094 -0.053550 -0.228384 -0.167151 0.051105 -0.120659 -0.002592 0.112382 0.109914 0.456065 -0.114414 -0.131451 -0.020964 -0.020887 0.474567 -0.121262 -0.195809 -0.188245 0.230463 0.181141 0.025877 -0.209333 0.061129 -0.076848
polarizability: 5.52213400e+02 -1.20835449e+01 2.46398873e+02 -7.48530878e-01 -1.67465508e+01 1.16775100e+02
1716.lowfreq: -2.1340 -1.8860 -0.0017 -0.0011 -0.0006 6.4813 16.7774 17.8523 24.1142
frequency: 16.6066 17.8387 24.1104 30.6236 40.7189 45.4646 56.6213 71.3381 91.2892 104.2144 121.7040 133.2516 165.8706 178.8412 202.0815 208.8443 217.8252 241.8813 242.7163 266.0442 300.3895 345.3178 354.9355 378.4456 401.4102 406.0327 421.9406 429.0729 469.6505 501.7253 524.2158 543.1433 590.8435 610.1600 625.2250 633.7169 670.8711 694.5183 698.1410 700.3113 720.3838 737.6632 738.3748 784.3729 790.7061 808.1275 828.2654 833.3941 835.5155 896.5097 915.9602 925.7687 951.0277 956.2747 958.7260 987.3350 996.7235 998.8628 1001.1160 1003.7656 1015.7505 1034.9565 1035.3158 1038.0602 1042.1352 1107.5128 1118.6343 1127.2695 1140.4879 1182.4714 1197.7467 1201.9171 1221.3888 1248.0067 1255.3211 1255.9994 1257.8017 1278.8385 1293.9374 1311.6419 1320.8394 1332.2677 1342.4750 1353.5914 1355.2337 1376.7700 1392.0875 1405.6396 1441.5848 1456.0060 1460.0540 1460.2514 1485.5028 1503.5370 1506.9036 1524.0676 1544.6414 1550.6441 1579.6435 1587.7880 1615.5389 1628.3011 2954.3040 3016.4110 3021.4053 3063.2128 3064.0978 3072.4758 3077.9233 3103.0848 3118.6627 3137.9117 3146.9752 3148.3169 3148.4318 3155.5218 3161.3335 3168.7689 3174.3688 3381.6679
redmass: 8.4510 6.6220 9.8755 13.4759 6.5842 7.9536 5.1637 4.1937 4.4352 4.8088 3.5210 2.6368 5.2121 6.5428 4.1693 4.8179 6.3551 4.4597 5.0354 3.7764 4.4648 4.9520 5.6113 3.2433 3.7188 4.0995 4.6486 3.5728 4.9846 4.2909 2.9514 3.4781 5.0020 7.1657 1.2652 6.8986 6.8126 7.2755 6.6352 5.8322 1.7766 3.7587 4.0629 1.1275 1.1809 1.3481 4.0493 1.5179 2.0648 5.8959 1.4275 1.4126 2.6552 1.5452 1.4554 1.3500 2.8234 1.4538 2.7898 1.6233 5.5923 4.2918 2.1020 3.6302 2.1400 1.6082 1.5794 2.8372 1.4815 1.6166 1.3625 1.1536 2.0879 2.2756 1.2801 1.5635 1.1750 1.3319 1.1839 10.9263 1.5718 1.3065 1.6571 1.3203 1.3700 3.7413 1.8604 1.9850 3.5528 2.0160 1.1003 1.1071 1.0987 1.3752 1.4042 2.7085 5.6113 6.7548 5.8316 5.6471 7.7742 6.3229 1.0865 1.0600 1.0608 1.0571 1.0576 1.1033 1.1039 1.0907 1.0891 1.0889 1.1012 1.1088 1.1007 1.0916 1.0933 1.0962 1.1001 1.0752
irintensity: 0.0097 0.4594 0.2891 0.9028 4.9544 1.8429 1.9397 0.2923 4.3888 7.5504 3.5767 0.2435 1.3247 2.6024 12.5704 7.2227 12.7225 16.0540 2.3783 8.3127 3.9745 13.9351 0.6218 6.7148 0.5176 3.9371 4.2879 1.9426 0.7645 1.7815 18.5026 14.6879 0.6917 2.3562 79.8969 4.4765 103.8625 17.9616 39.3002 52.8744 52.0851 5.0436 5.3359 3.0458 11.6192 17.3203 20.2404 45.0513 17.8164 37.0499 3.0456 19.8357 51.8665 20.5505 1.5609 2.5400 1.3424 4.7851 6.4032 4.3937 9.9742 0.9602 1.3901 11.4275 0.4252 42.4806 30.4811 172.8285 29.8584 150.7665 6.7401 89.2449 31.0975 163.5906 9.4152 147.0102 29.9385 63.7374 7.1042 2.3784 15.3044 4.4110 13.2676 40.4512 96.0885 16.0731 96.3207 15.1752 25.0379 50.2540 10.3246 13.8426 27.7744 191.2778 339.9389 65.7919 14.7087 23.2605 30.4262 110.4962 296.2066 390.5326 68.4601 23.1492 28.0617 11.7173 18.3381 9.1960 7.8247 36.1263 15.1218 7.3279 10.4645 18.2867 4.3342 12.0228 26.3631 17.1090 24.0816 20.7188
temp: 298.150 k
press: 1.00000 atm
elementType: 17 17 8 7 7 7 7 6 6 6 6 6 6 6 6 6 6 6 6 6 6 6 6 6 1 1 1 1 1 1 1 1 1 1 1 1 1 1 1 1 1 1
symmnumber: 1
zpe: 850247.4 jmol-1
zpe.correction: 0.323842 hartree
zpe.thermalcorrener: 0.347081 hartree
zpe.thermalcorrenthalpy: 0.348025 hartree
zpe.thermalcorrgfe: 0.265704 hartree
zpe.sumelectzpe: -1871.183988 hartree
zpe.sumelectthermal: -1871.160749 hartree
zpe.sumelectthermalent: -1871.159805 hartree
zpe.sumelectthermalfe: -1871.242127 hartree
dipole: 0.9327 -2.3491 1.7718
dipole: 3.0867
quadrupole: -147.9043 -172.7472 -156.3656
quadrupole: -1.1255 -8.7085 -0.3706
quadrupole: 11.1014 -13.7415 2.6401 -1.1255 -8.7085 -0.3706
hfenergy: -1871.5078305 hartree
pointgroup: C01 [X(C17H18Cl2N4O1)]
dipole: 0.3729471 0.9317376 -0.6837454 debye
polarizability: 552.195358|11.9306709|246.7423318|4.1776916|-15.1805489|116.4496831 unknown
InChI: InChI=1S/C17H18Cl2N4O/c18-7-10-23(11-8-19)16-5-3-14(4-6-16)12-21-22-17(24)15-2-1-9-20-13-15/h1-6,9,12-13,22H,7-8,10-11H2
charge 0 multiplicity 1
42 atoms
Cl 6.260165 -3.994716 0.039042
Cl 7.284791 3.292475 0.235537
O  -3.7651 -1.970821 0.383622
N  4.877377 -0.081451 0.022963
N  -1.668871 -0.136334 -0.019772
N  -3.009441 0.196163 -0.128605
N  -7.054047 1.599144 0.184842
C  5.43415 -1.357772 0.508242
C  5.839877 0.965678 -0.363933
C  3.486371 0.130956 -0.067206
C  2.553792 -0.908282 0.259924
C  2.952087 1.389008 -0.487157
C  5.529011 -2.387949 -0.633713
C  6.077981 1.950687 0.796897
C  0.642481 0.559448 -0.240833
C  1.172485 -0.695475 0.177729
C  1.564295 1.58854 -0.572537
C  -0.794862 0.802389 -0.331886
C  -5.413273 -0.224696 0.044034
C  -4.005544 -0.759521 0.126471
C  -6.458079 -1.153038 -0.199929
C  -5.772389 1.134598 0.250448
C  -7.787026 -0.69118 -0.267533
C  -8.037687 0.689945 -0.083229
H  6.444173 -1.178478 0.916966
H  4.827299 -1.764737 1.335694
H  6.799077 0.492892 -0.638708
H  5.49065 1.512105 -1.257605
H  2.907041 -1.893497 0.577617
H  3.613434 2.220772 -0.745397
H  6.207498 -2.059696 -1.435118
H  4.545049 -2.652251 -1.046586
H  6.548057 1.466523 1.665709
H  5.160553 2.475698 1.098792
H  0.472697 -1.498332 0.431488
H  1.189211 2.567312 -0.897922
H  -1.107322 1.812715 -0.672071
H  -3.28898 1.135871 -0.448857
H  -6.201283 -2.210275 -0.321015
H  -5.02335 1.891685 0.518073
H  -8.616203 -1.379273 -0.457981
H  -9.055446 1.091774 -0.140797
