program: Gaussian 09
title: 000260055
version: EM64L-G09RevD.01
frameworkgroup: C1[X(C16H20ClN3S)]
method: RPBEPBE
basis: SDD
operation: Freq
keyword: #p
keyword: freq=noraman
keyword: PBEPBE/SDD
title: #p freq=noraman PBEPBE/SDD
converged: YES YES NO NO
title: Mulliken charges:
elementType: Cl S N N N C C C C C C C C C C C C C C C C H H H H H H H H H H H H H H H H H H H H
charge: -0.068258 0.244740 -0.220746 -0.139273 -0.142953 -0.050780 -0.422420 -0.426618 -0.393844 -0.389504 -0.392313 0.102688 -0.145526 0.304599 -0.357727 -0.377290 -0.587350 -0.244484 -0.224399 -0.232718 -0.522180 0.228065 0.218393 0.223576 0.229986 0.208848 0.196902 0.208808 0.209981 0.193783 0.200611 0.204520 0.242979 0.265763 0.272618 0.301863 0.230309 0.231704 0.232853 0.315821 0.268976
chargesum: 0.00000
title: Mulliken charges with hydrogens summed into heavy atoms:
elementType: Cl S N N N C C C C C C C C C C C C C C C C
charge: -0.068258 0.244740 -0.220746 -0.139273 -0.142953 0.177285 0.019549 0.012215 0.011865 0.014260 0.012818 0.102688 -0.145526 0.304599 -0.114748 -0.111527 -0.012870 -0.014175 0.007305 0.000135 0.062618
polarizability: 2.99348614e+02 1.32513199e+01 2.03391830e+02 -1.29968016e+01 2.30203638e+01 1.59505344e+02
1716.lowfreq: -6.9593 -5.4040 -0.0023 -0.0008 -0.0008 11.9203 19.4803 29.0576 39.3841
frequency: 19.2567 29.0269 39.2762 48.7264 53.0585 71.0585 86.3582 103.7795 119.1121 148.8106 170.9007 192.3258 216.0908 223.0935 263.6894 281.1481 317.5502 326.1592 363.5244 385.1713 404.5064 407.9343 423.6903 441.6365 465.9056 494.9930 502.2150 575.5449 596.3382 611.0718 614.4877 658.4225 681.9641 704.2932 706.5411 750.8907 772.9210 786.0193 810.7805 849.9660 856.4762 862.2207 891.7599 899.0083 919.9479 928.2999 929.2228 935.9728 980.6286 987.0195 989.6306 990.3111 999.7957 1024.6557 1046.4746 1050.9659 1063.0222 1076.4258 1077.4984 1086.1304 1111.9515 1126.9516 1139.5421 1174.4044 1178.5718 1191.4734 1199.8558 1203.2415 1235.8803 1256.4652 1260.3174 1264.9443 1284.9652 1294.7059 1300.8199 1311.0367 1315.4918 1334.5696 1338.3204 1341.7561 1344.0112 1349.3926 1353.3111 1377.7285 1399.8183 1404.9877 1429.5658 1444.4404 1447.3591 1465.3638 1465.7177 1467.0860 1473.0560 1481.2698 1512.2900 1583.7886 1615.9993 2967.5112 2970.6969 2975.7724 2985.4067 2989.9666 3017.6194 3035.6587 3036.8657 3038.0633 3043.6241 3048.3115 3056.7430 3059.3113 3118.4196 3126.4053 3135.2430 3147.2388 3152.8978 3159.3683 3171.3190
redmass: 11.0070 7.7839 3.8458 3.6063 5.6703 3.6733 4.7818 5.2485 4.8373 5.3837 3.4938 4.7741 3.6405 2.0352 7.9415 2.6088 2.1106 4.4052 4.2840 3.4216 3.8718 2.9239 2.9023 3.6112 6.3239 1.8982 3.6031 5.0148 6.1673 4.1098 6.3857 11.5410 5.8225 2.3960 3.7580 2.9535 1.9331 1.4422 3.2843 1.7751 1.2439 1.7259 2.0146 1.5865 1.8286 1.7752 1.4566 4.4340 1.4096 4.1489 3.2962 9.7878 1.3458 2.6086 1.8368 2.5250 1.2136 1.4301 1.9960 2.0421 2.6909 1.1237 2.7430 1.0590 3.5517 1.1528 1.5584 1.1582 2.3398 2.1261 1.2866 1.5180 1.7676 1.2774 1.4246 1.3072 1.5804 1.3536 1.6871 1.3431 1.4550 1.6103 2.5879 7.4579 1.6967 1.1063 2.5435 2.4604 1.0891 1.0881 1.0875 1.0898 1.0847 1.0974 4.1159 6.0359 6.1420 1.0651 1.0652 1.0613 1.0605 1.0613 1.0847 1.0969 1.0579 1.0949 1.1015 1.1034 1.0604 1.1021 1.1060 1.0852 1.0881 1.0932 1.1069 1.0965 1.1006
irintensity: 1.3265 0.6625 0.3213 0.3337 1.6065 2.2434 1.4262 4.2729 2.8441 3.8897 1.1367 0.2867 0.3600 0.0228 3.2240 2.0387 0.4377 4.7800 5.2253 4.7013 4.6013 0.0722 0.5373 0.3918 1.9064 2.2703 3.9855 9.0096 10.3367 22.0966 1.2124 1.1365 4.4966 53.0212 9.3160 6.1212 49.0498 1.0623 4.9124 2.8337 0.2763 48.2177 3.8540 14.2667 0.3860 6.2344 7.9886 5.0272 1.0059 14.4605 10.2299 8.4251 0.1369 3.1539 0.6719 1.3830 1.0831 2.0973 2.1213 9.7769 0.0857 11.7228 11.8559 0.1339 10.3162 0.6024 0.0610 4.1446 7.4539 1.1723 1.7769 11.9504 100.3331 8.2846 0.8349 0.7586 13.3058 0.9045 52.0976 0.7230 1.1718 12.6826 47.6683 8.4726 3.4670 29.5258 30.0443 21.8108 13.4123 5.0721 2.3028 15.4030 16.5468 4.5862 3.4845 1.1703 4.9469 26.4177 33.3249 31.7166 19.4597 14.1785 13.1087 64.6231 11.1208 58.4068 8.0215 15.5866 17.5198 77.2073 0.6640 3.7592 2.6145 27.7979 4.5002 21.6202 15.4455
temp: 298.150 k
press: 1.00000 atm
elementType: 17 16 7 7 7 6 6 6 6 6 6 6 6 6 6 6 6 6 6 6 6 1 1 1 1 1 1 1 1 1 1 1 1 1 1 1 1 1 1 1 1
symmnumber: 1
zpe: 873456.9 jmol-1
zpe.correction: 0.332682 hartree
zpe.thermalcorrener: 0.352665 hartree
zpe.thermalcorrenthalpy: 0.353609 hartree
zpe.thermalcorrgfe: 0.281290 hartree
zpe.sumelectzpe: -1642.505167 hartree
zpe.sumelectthermal: -1642.485184 hartree
zpe.sumelectthermalent: -1642.484240 hartree
zpe.sumelectthermalfe: -1642.556559 hartree
dipole: -2.8962 3.7984 -0.8621
dipole: 4.8537
quadrupole: -130.7257 -141.7702 -138.3672
quadrupole: -2.7236 -10.7225 3.0229
quadrupole: 6.2286 -4.8158 -1.4128 -2.7236 -10.7225 3.0229
hfenergy: -1642.8378491 hartree
pointgroup: C01 [X(C16H20Cl1N3S1)]
dipole: 0.9095013 1.6161412 0.4555007 debye
polarizability: 301.6540279|1.167765|202.0933445|5.2547833|-24.0011858|158.4984151 unknown
InChI: InChI=1S/C16H20ClN3S/c17-11-12-21-16-19-18-15(13-7-3-1-4-8-13)20(16)14-9-5-2-6-10-14/h1,3-4,7-8,14H,2,5-6,9-12H2
charge 0 multiplicity 1
41 atoms
Cl -5.293728 -1.480283 -2.124361
S  -3.178444 0.049118 0.28255
N  -0.333541 -0.08799 0.134906
N  0.037241 -2.305473 0.438938
N  -1.362324 -2.072358 0.503075
C  -0.0834 1.380682 0.046628
C  -0.607898 2.136888 1.293578
C  -0.632731 1.982837 -1.270127
C  -0.247329 3.639367 1.191641
C  -0.282359 3.488399 -1.356999
C  -0.791002 4.261942 -0.11666
C  0.638345 -1.110626 0.209844
C  -1.550419 -0.74438 0.321833
C  2.095105 -0.952734 0.054445
C  2.671339 -0.130075 -0.952651
C  2.952513 -1.706231 0.901617
C  -4.226918 -1.51834 0.491995
C  4.073545 -0.041565 -1.087317
C  4.352902 -1.619127 0.760266
C  4.919696 -0.779841 -0.228037
C  -4.332672 -2.370806 -0.763594
H  1.016934 1.489488 0.042225
H  -0.168388 1.691173 2.206004
H  -1.706466 2.029331 1.373314
H  -1.731725 1.854799 -1.310477
H  -0.213889 1.434344 -2.13586
H  0.85554 3.758604 1.223934
H  -0.65192 4.175604 2.070661
H  -0.714864 3.915484 -2.281345
H  0.818574 3.607662 -1.434283
H  -1.899732 4.238474 -0.09989
H  -0.492652 5.325452 -0.184566
H  2.027904 0.402665 -1.662074
H  2.503359 -2.359576 1.656162
H  -5.207726 -1.146901 0.829335
H  -3.744791 -2.108678 1.289634
H  4.503899 0.590384 -1.871903
H  5.002109 -2.204909 1.420112
H  6.007851 -0.710955 -0.334558
H  -3.348194 -2.618974 -1.181334
H  -4.907142 -3.288775 -0.559957
