program: Gaussian 09
title: 000260072
version: EM64L-G09RevD.01
frameworkgroup: C1[X(C19H22O4)]
method: RPBEPBE
basis: SDD
operation: Freq
keyword: #pfreq=noraman
keyword: PBEPBE/SDD
title: #p freq=noraman PBEPBE/SDD
converged: YES YES NO NO
title: Mulliken charges:
elementType: O O O O C C C C C C C C C C C C C C C C C C C H H H H H H H H H H H H H H H H H H H H H H
charge: -0.298041 -0.284148 -0.300442 -0.248638 -0.578061 0.567719 -0.522114 -0.567916 -0.614264 0.141442 0.254682 0.280206 0.306732 0.031617 -0.335608 -0.357887 0.443472 -0.416718 -0.366756 -0.804405 -0.526516 -0.536728 -0.518178 0.205254 0.238549 0.248560 0.239614 0.287053 0.256530 0.243196 0.273389 0.234230 0.234467 0.230776 0.227965 0.240438 0.222545 0.266189 0.210100 0.228354 0.237729 0.229829 0.216127 0.255634 0.224021
chargesum: 0.00000
title: Mulliken charges with hydrogens summed into heavy atoms:
elementType: O O O O C C C C C C C C C C C C C C C C C C C
charge: -0.298041 -0.284148 -0.300442 -0.248638 -0.134258 0.567719 -0.033940 -0.280863 -0.357734 0.141442 0.254682 0.280206 0.306732 0.031617 -0.092412 -0.084498 0.443472 -0.182488 -0.132288 -0.105226 0.172318 0.159185 0.177603
polarizability: 2.73300857e+02 -1.12192229e+01 2.27345580e+02 -8.12352828e+00 -5.38286968e+00 1.77686816e+02
1716.lowfreq: -9.5032 -6.6505 -5.1151 -0.0001 0.0005 0.0008 5.4090 10.2560 14.8181
frequency: 2.4600 9.7210 14.6292 31.5880 52.4732 66.2786 74.8904 82.4748 103.1415 106.4528 112.4068 130.7492 151.8731 161.2255 178.3685 184.1436 201.0355 224.0547 243.4099 264.0882 272.3652 282.3480 295.7090 325.7441 344.8067 351.9021 384.9911 402.7302 429.4005 452.3153 464.3716 481.0148 495.3080 531.4363 567.4337 586.1258 601.3134 622.6446 633.9174 667.4693 704.9560 715.0562 725.8672 760.0126 797.0941 820.7989 858.8816 861.3817 872.0673 877.2809 887.7296 930.4232 948.7971 954.5307 966.8751 974.4436 990.7113 999.1126 1010.5149 1013.5693 1046.8622 1060.3090 1065.9622 1108.4372 1109.8435 1111.7764 1122.7856 1126.4480 1153.1087 1155.9375 1158.6685 1165.7640 1189.3742 1197.4909 1202.4722 1224.4637 1228.2789 1240.0580 1300.7138 1306.4587 1332.2328 1337.8099 1371.6328 1373.7324 1397.7884 1404.1687 1411.8362 1419.6003 1426.5288 1435.7543 1444.9946 1453.7918 1456.3158 1460.8220 1464.1876 1468.3936 1469.5153 1472.0381 1481.8715 1482.4315 1486.4507 1502.7741 1560.7126 1581.1495 1591.6456 1603.7035 1621.9539 2962.8716 2965.5275 2969.4148 2974.9250 2977.2142 3004.1878 3028.6846 3055.4784 3057.9732 3063.6423 3076.8499 3079.4079 3088.9309 3119.1438 3121.8393 3122.2964 3124.8183 3127.0130 3147.4998 3153.4048 3158.7744 3170.8449
redmass: 1.0453 4.3262 4.9031 3.6777 3.8823 3.7973 2.9456 2.6090 5.1537 2.8536 4.5712 2.3456 1.4137 1.2804 3.2565 2.1674 2.4978 2.6814 3.4273 3.5902 2.4668 3.8433 4.6879 2.9225 4.7783 3.2257 3.8087 2.8291 4.6086 3.1837 4.4207 4.7037 5.0621 4.4385 3.0427 4.3349 4.6787 4.1908 6.9210 3.6678 3.5905 4.5322 3.2034 4.1000 4.9306 1.4141 1.2805 4.0621 1.6794 1.5067 4.0650 2.7958 3.5657 5.0883 1.9221 1.9577 1.5510 1.4352 3.2145 3.0268 1.5892 3.4809 4.0427 1.2396 1.2403 1.2631 1.3725 2.2989 1.3312 1.3685 1.4233 1.3968 1.2359 1.8144 1.2546 3.0410 1.6753 2.0818 2.6471 1.3505 1.8320 1.8369 6.0639 4.8500 1.2346 1.6781 3.6077 1.2684 1.1009 1.3434 1.3658 1.1194 1.0861 1.1123 1.0522 1.0968 1.4037 1.0790 1.1961 1.3758 1.0956 2.6142 6.2624 7.5112 7.4538 6.6328 6.4552 1.0634 1.0322 1.0343 1.0319 1.0386 1.0613 1.0942 1.1041 1.0952 1.1019 1.0976 1.1011 1.0997 1.1039 1.1045 1.1005 1.0889 1.0885 1.0918 1.0948 1.0959 1.0910
irintensity: 0.4805 0.4082 0.8575 0.5537 1.0927 1.5130 10.9067 8.0540 2.7382 1.8772 0.9360 1.4279 0.0102 1.6245 4.9366 4.0135 3.7499 1.9189 0.4155 2.3026 0.2996 10.1694 3.3310 1.9579 0.7284 7.0059 12.0846 0.1234 2.9628 2.8253 3.9775 13.9528 3.8776 10.2739 7.4208 4.7382 0.3185 7.0827 0.7007 11.3464 0.9387 11.2579 6.2302 17.6346 1.4952 60.3119 7.5551 9.2154 52.0992 0.7835 7.8832 9.0683 20.2761 26.0947 20.5949 37.5019 22.2258 5.7936 17.4109 6.4056 18.6609 93.7317 163.8326 11.5290 2.7841 0.3900 18.3730 18.7822 2.8970 12.7381 25.3091 15.7108 96.0232 40.9486 3.6291 26.8733 64.2854 99.2499 79.3784 4.9336 54.1078 60.5771 4.7384 3.4628 15.6202 58.2858 14.5409 12.2050 16.3610 15.0101 24.8288 27.7690 4.5719 26.6197 11.2949 22.5785 77.0029 18.5998 37.1952 10.0741 36.7393 0.1533 102.2967 108.6880 82.6008 35.3881 40.1358 46.2551 63.2885 101.8253 67.2157 25.5154 29.8898 20.3972 41.8581 20.2814 9.5726 33.6812 32.6724 16.4598 22.0123 20.7684 26.4500 12.9147 18.0917 5.3256 18.2267 3.0398 2.1901
temp: 298.150 k
press: 1.00000 atm
elementType: 8 8 8 8 6 6 6 6 6 6 6 6 6 6 6 6 6 6 6 6 6 6 6 1 1 1 1 1 1 1 1 1 1 1 1 1 1 1 1 1 1 1 1 1 1
symmnumber: 1
zpe: 954612.3 jmol-1
zpe.correction: 0.363593 hartree
zpe.thermalcorrener: 0.387834 hartree
zpe.thermalcorrenthalpy: 0.388778 hartree
zpe.thermalcorrgfe: 0.303648 hartree
zpe.sumelectzpe: -1036.368555 hartree
zpe.sumelectthermal: -1036.344313 hartree
zpe.sumelectthermalent: -1036.343369 hartree
zpe.sumelectthermalfe: -1036.428499 hartree
dipole: -3.9637 0.2453 1.2865
dipole: 4.1744
quadrupole: -119.0150 -122.8805 -134.2303
quadrupole: 2.6880 -7.6244 4.1674
quadrupole: 6.3603 2.4948 -8.8550 2.6880 -7.6244 4.1674
hfenergy: -1036.7321474 hartree
pointgroup: C01 [X(C19H22O4)]
dipole: 1.2169445 1.0925906 -0.1504007 debye
polarizability: 250.5026767|42.8869848|202.2793643|1.8380942|9.1221194|225.5512124 unknown
InChI: InChI=1S/C19H22O4/c1-13-5-8-15(9-6-13)16(20)10-7-14-11-17(21-2)19(23-4)18(12-14)22-3/h5-6,8-9,11-12H,7,10H2,1-4H3
charge 0 multiplicity 1
45 atoms
O  -4.002669 -1.174768 -2.072053
O  -2.683867 -0.459318 2.571527
O  -4.661425 -0.379942 0.598253
O  2.101024 -0.689498 1.183999
C  0.668971 -2.187716 -0.773582
C  -0.734541 -1.728278 -0.394269
C  1.608568 -1.024144 -1.186076
C  -1.022228 -1.319996 0.932457
C  -1.763563 -1.699144 -1.361063
C  2.22539 -0.263009 -0.004546
C  -3.059833 -1.240775 -1.026313
C  -2.316722 -0.871319 1.276813
C  3.014035 0.983372 -0.284072
C  -3.350551 -0.803322 0.294088
C  3.209252 1.495491 -1.594767
C  3.601512 1.677627 0.809616
C  4.548887 3.365033 -0.711486
C  3.967503 2.666356 -1.80114
C  4.354356 2.845527 0.59836
C  5.337477 4.642148 -0.931238
C  -5.277583 -1.894713 -1.862299
C  -1.662764 -0.55668 3.619354
C  -4.792837 1.012418 1.079622
H  0.603113 -2.892897 -1.622632
H  1.134577 -2.724313 0.07273
H  1.065492 -0.316573 -1.841864
H  2.451734 -1.41879 -1.792455
H  -0.218331 -1.352877 1.672417
H  -1.587567 -2.026452 -2.391236
H  2.775292 0.984118 -2.460114
H  3.452039 1.271197 1.815533
H  4.110637 3.046437 -2.819594
H  4.801486 3.366707 1.453649
H  6.232759 4.681635 -0.285144
H  5.665096 4.743256 -1.980006
H  4.722579 5.53065 -0.688474
H  -5.870762 -1.697435 -2.768736
H  -5.796555 -1.519478 -0.965077
H  -5.088506 -2.982098 -1.766998
H  -1.325301 -1.602454 3.750308
H  -2.160509 -0.207618 4.536335
H  -0.789645 0.085668 3.395209
H  -4.400288 1.719088 0.323615
H  -4.262036 1.140961 2.037822
H  -5.874295 1.169213 1.214932
