program: Gaussian 09
title: 000023556
version: EM64L-G09RevD.01
frameworkgroup: C1[X(C8H6O2)]
method: RPBEPBE
basis: SDD
operation: Freq
keyword: #p
keyword: freq=noraman
keyword: PBEPBE/SDD
title: #p freq=noraman PBEPBE/SDD
converged: NO NO NO NO
title: Mulliken charges:
elementType: O O C C C C C C C C H H H H H H
charge: -0.247298 -0.197129 0.118110 0.231479 -0.402896 0.059197 -0.326673 -0.338060 -0.241192 -0.177741 0.262047 0.262040 0.268780 0.258056 0.236243 0.235036
chargesum: 0.00000
title: Mulliken charges with hydrogens summed into heavy atoms:
elementType: O O C C C C C C C C
charge: -0.247298 -0.197129 0.118110 0.231479 0.121191 0.059197 -0.057894 -0.080003 -0.004948 0.057295
polarizability: 1.27736908e+02 -2.13637677e+00 9.65172822e+01 -1.56868313e-03 4.10164245e-03 3.96735262e+01
1716.lowfreq: -0.0008 -0.0007 0.0003 3.3490 15.0782 15.4855 130.1321 165.8300 246.6084
frequency: 130.1276 165.7882 246.6008 260.0723 407.7917 487.0428 494.3978 532.2841 559.0993 569.7186 650.5401 731.9776 739.2263 767.4600 812.8039 868.6436 950.8309 951.4935 970.6692 991.1622 1000.9811 1018.3302 1090.1292 1139.9012 1154.6207 1176.6263 1206.5800 1285.0943 1293.2439 1399.7374 1427.0998 1449.0994 1460.8125 1597.7392 1614.9301 1641.3148 3028.4008 3097.5005 3137.5137 3150.9914 3166.9360 3177.8972
redmass: 4.1654 2.9099 5.5175 7.4838 3.1404 5.7513 3.0288 7.5470 6.1638 2.9461 10.1773 5.3166 4.1225 1.2597 5.8074 1.3556 1.6363 9.3774 1.7659 1.3317 3.5455 2.7021 2.1829 1.0906 1.3637 1.7807 2.0682 1.5653 1.5654 6.4126 1.1862 2.2277 2.7658 7.6250 7.6316 12.1942 1.0575 1.1072 1.0863 1.0907 1.0967 1.0987
irintensity: 6.9837 9.0027 2.1234 2.6816 1.8650 8.8489 8.7936 7.0398 4.0106 0.6493 12.9636 0.0311 0.1522 102.6573 23.4231 0.4516 2.9067 47.5113 0.4830 0.1238 9.3027 1.2737 36.2961 0.2435 23.3969 38.9523 10.9488 27.3929 14.9954 27.9593 2.2175 77.1778 27.8873 21.5968 217.5741 227.4370 10.3167 4.8798 2.7252 5.5398 15.8373 10.5784
temp: 298.150 k
press: 1.00000 atm
elementType: 8 8 6 6 6 6 6 6 6 6 1 1 1 1 1 1
symmnumber: 1
zpe: 311048.3 jmol-1
zpe.correction: 0.118472 hartree
zpe.thermalcorrener: 0.125846 hartree
zpe.thermalcorrenthalpy: 0.126790 hartree
zpe.thermalcorrgfe: 0.086400 hartree
zpe.sumelectzpe: -458.189652 hartree
zpe.sumelectthermal: -458.182278 hartree
zpe.sumelectthermalent: -458.181334 hartree
zpe.sumelectthermalfe: -458.221723 hartree
dipole: 2.3717 -1.3753 0.0001
dipole: 2.7416
quadrupole: -52.1647 -59.4611 -58.6663
quadrupole: 7.2490 -0.0002 0.0001
quadrupole: 4.5993 -2.6971 -1.9022 7.2490 -0.0002 0.0001
hfenergy: -458.3081237 hartree
pointgroup: C01 [X(C8H6O2)]
dipole: -0.9362299 0.5356204 0.0000218 debye
dipolederiv: -0.9795973 -0.4018206 -0.0000008 -0.3323627 -0.5785245 0.0000151 0.0000144 0.000046 -0.2489948 -0.9272824 0.3299692 0.0000118 0.5176668 -0.7867933 -0.0000255 -0.0000508 0.0000522 -0.3198546 -0.9727086 0.2915511 -0.0000296 -0.2401624 -0.2711631 0.0000142 0.000006 0.0000225 -0.0308964 0.8383789 0.5983062 -0.000028 0.3505444 0.4974975 -0.0000102 0.0000128 -0.0000277 0.0930012 0.4696175 -0.16402 0.0000022 -0.308405 -0.2438942 -0.0000048 -0.0000119 -0.0000392 0.2905767 1.5262934 -0.4110226 -0.0000106 -0.2959518 0.9342215 0.0000315 0.0000194 -0.0000205 0.123637 0.3616941 -0.2062177 0.0000344 0.2047437 0.1006425 -0.0000241 0.0000268 -0.0000456 -0.0906413 -0.3451074 -0.3854606 0.0000335 -0.0939433 0.0069912 -0.0000266 -0.0000005 -0.000025 -0.1837015 -0.2334663 0.2712989 -0.0000215 0.2668738 -0.2001057 0.0000032 -0.0000231 -0.0000051 -0.1946732 0.151297 0.0625142 0.0000051 -0.1188962 0.322608 -0.0000372 0.0000231 -0.0000349 -0.1133592 0.0300857 -0.0070624 -0.0524403 0.0257088 0.1063756 -0.0308016 -0.0996952 -0.041154 0.0030352 0.0300488 -0.0070742 0.0524664 0.0257088 0.1063905 0.0307993 0.0997142 0.0411584 0.0030579 0.0911454 0.050976 -0.0000101 0.004671 -0.0280427 0.0000212 -0.0000133 0.0000287 0.1599515 0.0866606 0.0216519 -0.0000039 0.0491923 -0.0462629 0.0000239 -0.0000111 0.0000173 0.1831532 -0.0268054 -0.0948732 0.0000049 -0.1003349 -0.0057779 0.0000129 0.0000089 0.0000198 0.1724098 -0.1002542 0.0512838 -0.0000135 0.0449469 0.0858377 0.0000088 -0.0000197 0.0000071 0.1532983 unknown
polarizability: 127.7607418|-1.9543454|96.4934487|0.0015926|-0.0040924|39.6735262 unknown
InChI: InChI=1S/C8H6O2/c9-7-5-10-8-4-2-1-3-6(7)8/h1-4H,5H2
charge 0 multiplicity 1
16 atoms
O  0.885942 1.770973 -0.000235
O  2.42531 -1.541879 -0.000032
C  0.183107 -0.482023 0.0000
C  -0.199662 0.88504 -0.000158
C  2.118771 0.939505 -0.000096
C  1.661034 -0.542213 -0.00012
C  -0.792085 -1.504853 0.000022
C  -1.549985 1.281916 -0.00027
C  -2.152007 -1.12882 -0.000058
C  -2.516451 0.249128 -0.000178
H  2.704021 1.18645 0.902444
H  2.704233 1.186378 -0.902519
H  -0.486879 -2.556387 0.000141
H  -1.834469 2.337778 -0.000388
H  -2.934929 -1.894223 -0.000012
H  -3.578252 0.519931 -0.000241
