program: Gaussian 09
title: 000260030
version: EM64L-G09RevD.01
frameworkgroup: C1[X(C10H7Cl3O3)]
method: RPBEPBE
basis: SDD
operation: Freq
keyword: #p
keyword: freq=noraman
keyword: PBEPBE/SDD
title: #p freq=noraman PBEPBE/SDD
converged: NO YES NO NO
title: Mulliken charges:
elementType: Cl Cl Cl O O O C C C C C C C C C C H H H H H H H
charge: 0.111002 0.163409 0.118959 -0.218260 -0.204843 -0.178698 0.273063 0.327300 0.080086 -0.684816 0.111088 -0.365102 -0.356537 -0.208207 -0.212926 -0.515482 0.276113 0.273853 0.241031 0.243229 0.254902 0.224364 0.246472
chargesum: 0.00000
title: Mulliken charges with hydrogens summed into heavy atoms:
elementType: Cl Cl Cl O O O C C C C C C C C C C
charge: 0.111002 0.163409 0.118959 -0.218260 -0.204843 -0.178698 0.273063 0.327300 0.080086 -0.684816 0.111088 -0.088989 -0.082684 0.032824 0.030303 0.210256
polarizability: 1.61159345e+02 -8.64968318e+00 1.54024103e+02 -2.12620251e+01 -1.16646866e+01 1.06606092e+02
1716.lowfreq: -10.4472 -5.3882 0.0018 0.0023 0.0029 5.0013 44.4863 64.0626 77.0775
frequency: 44.4271 64.0541 77.0732 95.9153 135.5782 143.1838 158.0327 185.2312 197.7095 221.7892 236.3377 255.5203 281.0126 303.2678 314.8902 339.1355 376.4679 418.5768 473.9651 512.8312 533.5876 574.9903 625.7119 661.5143 684.9753 718.9693 729.0300 737.6886 775.1237 788.9400 796.4979 826.1620 898.3682 944.8837 973.7346 988.2400 1007.1084 1018.0134 1040.0076 1087.6239 1100.6273 1116.4602 1161.9271 1175.6431 1189.7580 1234.5335 1280.7159 1406.0851 1430.3344 1450.9292 1459.4216 1460.3241 1477.6577 1607.6648 1615.2576 1719.1325 2982.7162 3085.6619 3139.0939 3142.6462 3156.5336 3171.2134 3180.8888
redmass: 14.2042 6.8703 4.5572 3.7475 5.7519 3.9376 1.6194 7.6435 5.2827 6.9919 8.3972 9.0180 10.5158 12.7279 7.4860 6.8020 20.3226 3.4208 4.7678 8.4280 6.2489 8.2217 9.1666 5.1866 6.3029 5.9392 7.7990 9.7187 5.6800 1.5002 9.2710 9.7867 1.3583 8.7437 1.4373 7.5760 1.3430 3.2787 3.1149 7.0415 2.0385 1.2955 1.4994 1.1085 2.6931 3.8369 1.4720 8.5135 1.1380 2.4368 2.5031 1.0562 1.0523 7.4735 7.4581 13.0035 1.0327 1.1023 1.1024 1.0868 1.0912 1.0966 1.0987
irintensity: 0.7686 0.1389 3.2786 2.8495 0.2844 0.9595 0.0616 0.3648 1.8529 1.1430 1.9602 1.5874 1.0175 2.8339 6.7396 11.5302 1.7767 0.7191 6.9193 4.6415 4.8768 3.1561 16.1924 15.5703 44.2116 31.8233 125.0194 85.4539 39.5452 49.7481 80.8394 194.8693 1.8475 21.3815 3.5882 73.0476 0.0054 15.4403 40.7004 112.5749 6.1169 7.7195 4.1596 6.0737 9.5551 103.8651 2.2028 0.5034 4.5220 17.9361 2.3599 11.7018 17.8255 9.8836 3.8114 358.0759 38.8146 24.3942 12.4446 2.1172 5.8267 8.2316 9.4567
temp: 298.150 k
press: 1.00000 atm
elementType: 17 17 17 8 8 8 6 6 6 6 6 6 6 6 6 6 1 1 1 1 1 1 1
symmnumber: 1
zpe: 388734.9 jmol-1
zpe.correction: 0.148061 hartree
zpe.thermalcorrener: 0.163277 hartree
zpe.thermalcorrenthalpy: 0.164221 hartree
zpe.thermalcorrgfe: 0.105040 hartree
zpe.sumelectzpe: -1989.932561 hartree
zpe.sumelectthermal: -1989.917346 hartree
zpe.sumelectthermalent: -1989.916402 hartree
zpe.sumelectthermalfe: -1989.975582 hartree
dipole: 4.1038 -3.9991 2.2590
dipole: 6.1594
quadrupole: -103.9024 -118.9472 -107.1051
quadrupole: -8.3945 0.4038 2.9134
quadrupole: 6.0825 -8.9623 2.8798 -8.3945 0.4038 2.9134
hfenergy: -1990.0806223 hartree
pointgroup: C01 [X(C10H7Cl3O3)]
dipole: -1.6723741 1.4443382 0.9946444 debye
dipolederiv: -0.2085504 -0.086127 -0.0110991 -0.0878589 -0.7178566 -0.1607012 0.0318396 -0.0912134 -0.1603868 -0.6462934 0.2824111 -0.096375 0.2548588 -0.2430487 0.0598951 -0.0175262 0.039134 -0.1039021 -0.2687113 -0.024828 -0.1748734 -0.0350421 -0.1277184 -0.048994 -0.1959369 -0.0555434 -0.6289695 -1.1195406 -0.3982773 -0.2406265 -0.3601025 -0.7550909 -0.2432547 -0.1813405 -0.118772 -0.4944982 -0.4831697 -0.0006222 0.0471807 -0.0197231 -0.4056556 0.1607163 -0.0898574 0.1098919 -1.1869027 -0.5484203 -0.1583206 -0.0841652 -0.1892788 -1.1419209 -0.2077628 -0.0974178 -0.2023854 -0.3428388 0.7056535 0.0144837 0.1096052 0.3451292 0.56541 0.1640736 0.0195609 -0.0664302 1.0246138 -0.1282272 0.0651199 -0.0410134 -0.1823243 0.0063109 0.0140179 0.0155403 0.0572623 -0.1670055 -0.2016577 0.1609019 -0.012035 0.2588566 -0.4552839 -0.0497863 0.0240418 -0.0654753 0.0261837 1.0590021 -0.192619 0.355161 -0.1149708 1.1179009 0.1623848 0.1922307 0.1288489 0.8926988 1.4457771 0.3141019 0.3055326 0.0657724 1.6715725 0.2909597 0.2970451 0.3817685 0.3526996 -0.1345011 0.1755984 0.0405479 0.1115457 -0.0165233 0.0280816 0.0080124 0.0389579 -0.0892026 0.0231346 -0.0222505 0.0202797 0.1247838 0.0837535 0.0632649 0.0548671 0.0368303 -0.0717674 0.0423277 -0.0860241 0.0168282 -0.0709303 0.1317496 0.05269 0.0112721 0.0340269 -0.099138 0.1344272 -0.0623317 0.0470965 -0.0807028 -0.1324882 -0.0157793 0.0434781 -0.0106715 -0.134765 0.2140891 0.0174972 -0.2572596 -0.0413111 0.2791909 -0.2115521 0.0044877 -0.0800754 0.5824549 0.0780574 -0.0730337 -0.0458217 -0.0506629 0.0441689 -0.0275179 -0.0237955 -0.0275926 0.1335793 0.0604716 -0.0291697 -0.0264477 -0.0673736 0.0342314 -0.0415079 -0.041242 -0.0327899 0.1442107 0.0564829 0.0664518 -0.0036079 0.0788418 -0.0541797 -0.0336388 -0.0026619 -0.0359538 0.1423705 -0.0869306 0.0431042 -0.0397052 0.0403951 0.0891814 -0.0068271 -0.0389305 -0.0069313 0.1476796 0.0826223 -0.0283773 0.0678418 -0.0157602 -0.0952596 0.0611168 0.0308891 -0.0512646 0.0582237 -0.1172563 0.0498358 0.1122977 0.0784815 0.0166592 0.027813 0.0220855 0.0264299 0.0484206 0.0412133 -0.0275249 -0.0893416 -0.0426234 0.1048966 -0.0376916 -0.0666419 -0.008052 -0.0737588 unknown
polarizability: 165.5425954|-6.3857461|153.151962|15.4770023|12.9893885|103.0949828 unknown
InChI: InChI=1S/C10H7Cl3O3/c1-15-9(10(11,12)13)7-5-3-2-4-6(7)8(14)16-9/h2-5H,1H3
charge 0 multiplicity 1
23 atoms
Cl 2.281555 2.277246 -0.304398
Cl 3.562318 -0.445885 -0.437471
Cl 1.374816 0.282401 -2.387043
O  0.752524 -1.55165 0.057219
O  1.435079 0.111907 1.658505
O  -0.947033 -3.00945 -0.636598
C  0.886854 -0.08797 0.355422
C  -0.531338 0.455778 0.155235
C  -1.378545 -0.596602 -0.24838
C  1.973619 0.466397 -0.6341
C  -0.604342 -1.860369 -0.331447
C  -1.040439 1.748776 0.363081
C  -2.751741 -0.399399 -0.484757
C  -2.422488 1.959869 0.128301
C  -3.268811 0.902629 -0.295935
C  0.674553 -0.510026 2.761738
H  -0.394511 2.566895 0.691692
H  -3.385869 -1.233828 -0.799936
H  -2.844886 2.959434 0.27691
H  -4.331368 1.09917 -0.472511
H  0.631738 -1.60434 2.627604
H  -0.346087 -0.089134 2.83133
H  1.247205 -0.260648 3.666137
