program: Gaussian 09
title: 000260053
version: EM64L-G09RevD.01
frameworkgroup: C1[X(C18H20Cl2N4O)]
method: RPBEPBE
basis: SDD
operation: Freq
keyword: #p
keyword: freq=noraman
keyword: PBEPBE/SDD
title: #p freq=noraman PBEPBE/SDD
converged: YES YES NO NO
title: Mulliken charges:
elementType: Cl Cl O N N N N C C C C C C C C C C C C C C C C C C H H H H H H H H H H H H H H H H H H H H
charge: -0.055287 -0.052252 -0.228953 -0.173994 0.049687 -0.412542 -0.002924 0.483934 -0.390280 -0.386359 -0.594012 0.340937 -0.380983 0.320544 -0.410780 -0.586179 -0.585469 -0.837896 -0.402419 0.178396 0.230733 -0.258124 -0.449048 -0.176985 -0.325703 0.251255 0.251379 0.248673 0.253648 0.234569 0.237526 0.284797 0.270017 0.295194 0.267829 0.295423 0.236675 0.232974 0.232228 0.215892 0.288983 0.283933 0.238909 0.237696 0.248356
chargesum: 0.00000
title: Mulliken charges with hydrogens summed into heavy atoms:
elementType: Cl Cl O N N N N C C C C C C C C C C C C C C C C C C
charge: -0.055287 -0.052252 -0.228953 -0.173994 0.049687 -0.123559 -0.002924 0.483934 0.112354 0.115962 -0.359443 0.340937 -0.143457 0.320544 -0.125983 -0.020968 -0.022216 -0.136019 -0.186527 0.178396 0.230733 0.025809 -0.210139 0.060711 -0.077347
polarizability: 5.65727619e+02 -1.19482381e+01 2.66072371e+02 -1.00015418e+00 -1.45804724e+01 1.25558113e+02
1716.lowfreq: -5.0501 -2.3394 -0.0026 -0.0021 -0.0017 3.8358 14.9200 15.5451 23.9359
frequency: 14.9104 15.5067 23.8708 28.6508 38.6624 42.3572 47.6895 65.2493 88.5644 102.6308 113.3480 126.9211 156.1428 164.9845 176.5842 189.1631 203.2873 211.2320 219.0962 222.6250 243.9964 249.1651 275.7971 335.0560 352.5089 373.8756 389.6063 403.8883 411.1392 422.4659 466.8831 479.1938 506.2287 534.4349 554.2257 591.1904 597.3275 610.9961 625.5495 667.6035 694.1216 697.6686 700.2229 705.1359 720.2122 740.6342 783.1670 789.1135 811.3880 828.6547 834.5335 854.8055 875.1664 901.9469 915.5579 933.7137 958.3884 963.4911 988.9347 997.8638 1000.9613 1003.8671 1006.1879 1016.0890 1034.7792 1036.8340 1037.5590 1041.5261 1050.5625 1106.5453 1107.5826 1119.2739 1136.4614 1175.3035 1197.6726 1212.7990 1221.7586 1248.2015 1254.3722 1257.2236 1264.3298 1282.1272 1293.4138 1305.1786 1311.6352 1331.0483 1339.1636 1351.9348 1354.2431 1373.6744 1394.6501 1400.6408 1405.5326 1441.0322 1455.9971 1458.9924 1459.8352 1475.0486 1478.2435 1486.6138 1503.1586 1506.6451 1517.8728 1543.9289 1546.9227 1575.4992 1583.5977 1614.4142 1626.0705 2974.7644 2984.7507 3015.8565 3020.9555 3052.1272 3062.8499 3063.3225 3071.8446 3077.0849 3085.4502 3101.9377 3137.6937 3145.5505 3147.2122 3147.8989 3148.3414 3155.4472 3168.5530 3174.3095 3377.8948
redmass: 7.8507 6.7788 9.8115 11.8555 5.7341 6.6480 5.8688 5.3613 3.8610 4.4521 3.2893 2.7930 1.1754 4.4705 5.4643 3.4333 3.3893 5.6955 4.5099 4.6840 4.1674 3.3314 4.5962 4.0374 5.5628 3.4287 3.9193 4.0405 4.8821 4.1539 3.0934 5.4007 4.1606 5.0840 4.2249 2.9553 4.7857 6.5359 1.2829 7.0428 7.2406 6.3346 6.0220 4.7741 1.7792 3.1685 1.1261 1.1920 4.2134 1.4084 1.8092 1.5072 5.3963 5.4445 1.4279 1.5177 1.4552 2.1843 1.3567 1.4247 2.8346 1.5854 1.5792 5.4319 3.8149 3.6260 3.7005 1.5660 1.6191 2.5296 1.6307 1.4610 2.7041 1.4943 1.3642 1.7670 2.0433 2.5873 1.1820 1.1879 1.5167 1.5749 1.1967 1.4235 10.9053 1.3733 1.6490 1.2510 1.4577 2.8712 1.9418 1.4118 1.9883 2.6170 1.9476 1.1347 1.0941 1.0465 1.3326 1.1515 1.6637 1.1715 2.4388 5.7707 5.8740 5.4412 5.7813 7.8070 6.3365 1.0415 1.0820 1.0601 1.0607 1.0976 1.0571 1.0578 1.1032 1.1039 1.0979 1.0908 1.0889 1.0975 1.0959 1.1049 1.1023 1.0916 1.0959 1.1001 1.0752
irintensity: 0.0162 0.4618 0.2284 0.7614 5.6991 0.3929 0.9101 1.9218 4.5962 6.9970 3.4736 1.1178 1.7173 3.4078 1.0234 3.9921 6.4105 15.9990 3.6287 6.5493 6.2974 9.0709 11.2173 10.5463 4.0739 4.3989 3.1526 0.1661 4.2542 3.8911 6.7937 2.0339 4.3332 3.3749 11.8280 0.9283 1.4770 4.0925 77.6754 94.0407 14.8832 47.0493 44.4654 24.5832 51.6656 1.7924 2.8981 8.9833 16.5826 25.9431 25.8189 23.6942 5.5644 45.5260 3.4436 28.7007 0.9726 24.9475 2.4165 5.6329 7.8715 2.8478 15.2412 10.8390 0.1208 3.8606 9.6318 6.4958 9.9257 1.4840 44.7063 48.3437 264.7943 32.7136 14.3111 35.5224 30.3135 243.4382 9.1263 22.2032 15.1065 157.0760 6.7092 30.5475 2.8464 17.1478 46.4168 1.5318 136.9520 31.2503 97.9788 8.9174 13.3094 27.3302 47.5355 13.9770 10.4098 13.4740 13.0212 29.5890 341.3393 116.0785 33.7200 19.8039 1.8052 179.7632 87.0880 282.6187 446.0932 10.7482 77.0506 22.5260 30.1305 17.6373 7.7258 21.9425 9.1616 7.4528 22.3121 35.9949 7.4420 20.7020 22.8090 11.5982 6.4142 12.1316 19.6221 24.4573 23.0736
temp: 298.150 k
press: 1.00000 atm
elementType: 17 17 8 7 7 7 7 6 6 6 6 6 6 6 6 6 6 6 6 6 6 6 6 6 6 1 1 1 1 1 1 1 1 1 1 1 1 1 1 1 1 1 1 1 1
symmnumber: 1
zpe: 921711.8 jmol-1
zpe.correction: 0.351061 hartree
zpe.thermalcorrener: 0.376042 hartree
zpe.thermalcorrenthalpy: 0.376986 hartree
zpe.thermalcorrgfe: 0.290743 hartree
zpe.sumelectzpe: -1910.411308 hartree
zpe.sumelectthermal: -1910.386328 hartree
zpe.sumelectthermalent: -1910.385383 hartree
zpe.sumelectthermalfe: -1910.471627 hartree
dipole: 0.7741 -2.8492 1.8417
dipole: 3.4797
quadrupole: -156.3461 -178.2669 -162.6093
quadrupole: -0.8558 -8.5497 -1.0168
quadrupole: 9.3946 -12.5261 3.1315 -0.8558 -8.5497 -1.0168
hfenergy: -1910.7623696 hartree
pointgroup: C01 [X(C18H20Cl2N4O1)]
dipole: 0.3131472 -1.1349641 0.6986129 debye
polarizability: 565.7611706|-11.0517643|266.5505477|-4.3472751|-11.537139|125.0463842 unknown
InChI: InChI=1S/C18H20Cl2N4O/c1-14-11-17(24(9-6-19)10-7-20)5-4-15(14)13-22-23-18(25)16-3-2-8-21-12-16/h2-5,8,11-13,23H,6-7,9-10H2,1H3
charge 0 multiplicity 1
45 atoms
Cl 7.303432 -3.047814 -0.454231
Cl 6.093848 4.192402 0.11144
O  -3.772697 2.083532 -0.329821
N  4.812989 0.24749 -0.048589
N  -1.699998 0.206416 -0.004656
N  -3.045077 -0.114258 0.082549
N  -7.106988 -1.449607 -0.309609
C  3.427216 -0.002678 0.032612
C  5.804225 -0.792152 0.279332
C  5.334209 1.558931 -0.475721
C  2.924578 -1.291786 0.387715
C  1.543912 -1.566496 0.477379
C  2.470859 1.027315 -0.238885
C  0.601425 -0.52555 0.196417
C  1.100485 0.761042 -0.159504
C  6.063974 -1.704231 -0.935279
C  5.409883 2.537026 0.712559
C  1.098622 -2.969701 0.86367
C  -0.840085 -0.760059 0.268196
C  -4.028493 0.864221 -0.130543
C  -5.443091 0.343932 -0.077692
C  -6.476855 1.273193 0.206928
C  -5.819207 -0.999074 -0.349663
C  -7.811869 0.826038 0.248809
C  -8.079731 -0.541433 -0.001251
H  6.751331 -0.309673 0.578412
H  5.472385 -1.396326 1.141824
H  6.346122 1.425427 -0.897378
H  4.71158 1.988311 -1.279757
H  3.616231 -2.113627 0.597465
H  2.792077 2.037506 -0.507339
H  0.373379 1.552397 -0.368487
H  6.520165 -1.160096 -1.775543
H  5.157987 -2.232041 -1.265329
H  6.102412 2.190359 1.493972
H  4.422079 2.755375 1.142658
H  1.969155 -3.625409 1.032007
H  0.500813 -2.969305 1.794803
H  0.479908 -3.437463 0.074621
H  -1.181843 -1.773841 0.556845
H  -3.337315 -1.064663 0.357338
H  -6.206775 2.320122 0.378277
H  -5.07923 -1.752209 -0.651353
H  -8.632745 1.515173 0.469169
H  -9.102781 -0.932217 0.034529
