program: Gaussian 09
title: 000260069
version: EM64L-G09RevD.01
frameworkgroup: C1[X(C19H17NO4)]
method: RPBEPBE
basis: SDD
operation: Freq
keyword: #p
keyword: freq=noraman
keyword: PBEPBE/SDD
title: #p freq=noraman PBEPBE/SDD
converged: YES YES NO NO
title: Mulliken charges:
elementType: O O O O N C C C C C C C C C C C C C C C C C C C H H H H H H H H H H H H H H H H H
charge: -0.291567 -0.291456 -0.287860 -0.250201 -0.014088 0.609584 0.053777 0.244521 0.278573 -0.564122 -0.580765 -0.289945 -0.315462 0.307015 0.095857 -0.327519 -0.341187 -0.389042 -0.375125 0.395030 -0.513650 -0.522974 -0.533714 -0.258374 0.254127 0.252893 0.272125 0.211632 0.230389 0.287953 0.258458 0.259878 0.232025 0.222711 0.264249 0.265093 0.215069 0.230987 0.231810 0.246963 0.226330
chargesum: 0.00000
title: Mulliken charges with hydrogens summed into heavy atoms:
elementType: O O O O N C C C C C C C C C C C C C C C C C C C
charge: -0.291567 -0.291456 -0.287860 -0.250201 -0.014088 0.609584 0.053777 0.244521 0.278573 -0.309995 -0.327872 -0.017820 -0.103830 0.307015 0.095857 -0.097130 -0.053234 -0.130585 -0.115247 0.395030 0.205336 0.188175 0.171390 -0.258374
polarizability: 5.33943034e+02 5.21926387e+00 2.47730223e+02 -5.41868549e+00 6.81472167e+00 1.06876838e+02
1716.lowfreq: -2.6075 -0.0003 0.0005 0.0005 3.1311 6.5005 14.0483 19.2835 33.3770
frequency: 13.8839 19.2741 33.3695 46.6601 66.4915 75.3026 77.1779 93.1821 103.5862 109.6446 136.4945 140.6318 144.4057 160.6575 174.0894 198.8673 211.0382 217.5184 230.9970 255.4802 274.6214 286.5089 303.8523 311.0001 361.5535 379.9178 399.6660 414.5665 423.4402 475.9649 487.9809 513.5754 533.0735 554.0566 558.2877 572.1460 591.4564 614.6220 640.0334 664.5650 687.8032 720.0613 761.8850 762.5215 766.5679 842.2072 843.8536 849.5536 867.5675 872.1214 882.3834 891.4734 932.1307 950.6336 975.3299 1007.2923 1009.2831 1013.7042 1014.8333 1042.0194 1069.8837 1108.4013 1110.8044 1111.4265 1117.5805 1138.2565 1153.1981 1157.7135 1160.6394 1188.6435 1201.7812 1214.0975 1221.2293 1233.9660 1274.0928 1297.4421 1326.2885 1349.3125 1364.7840 1377.8005 1406.6541 1411.3459 1422.6892 1437.2458 1443.3946 1454.3490 1457.6116 1467.1360 1467.6730 1478.9975 1481.0497 1485.1813 1491.3664 1510.1587 1564.0758 1565.6227 1597.1059 1614.3414 1630.0939 2177.0015 2967.4095 2978.1096 2988.7694 3059.4272 3087.4303 3093.6960 3098.9365 3129.1330 3131.0847 3135.1591 3146.5715 3151.9168 3155.0838 3156.1151 3169.3047 3170.0959 3174.2570
redmass: 4.7884 4.7418 6.5370 4.1945 2.8399 5.7267 2.5112 2.6589 4.2328 4.4791 3.3383 1.3507 5.4925 1.5591 4.3870 3.5324 2.9112 2.1032 3.3332 3.9052 5.6434 2.4888 4.9054 4.2273 6.4470 4.6564 2.8206 5.4905 5.8702 5.6784 5.9349 5.9100 8.2865 4.9062 5.0450 6.7058 4.0737 3.3948 7.4099 4.7755 3.7405 5.0862 3.7573 3.3763 5.6165 1.6340 4.8674 1.4531 2.5498 2.1908 1.9262 1.9005 6.6275 8.9429 1.4061 3.0250 1.5176 1.4350 2.3799 3.1194 6.2709 1.2336 1.2372 1.2566 1.4005 2.2708 1.4314 1.4839 1.5640 1.5326 2.2026 1.9655 2.2318 1.4209 2.3762 1.3347 1.6438 3.7334 4.0348 4.8458 2.3745 3.0058 1.3157 1.3854 1.3953 1.1218 1.0930 1.0577 1.4449 1.3367 1.2012 1.0625 2.6629 7.4287 7.2752 7.0711 5.9907 6.1643 5.4826 12.6321 1.0325 1.0342 1.0320 1.1045 1.0979 1.0890 1.1005 1.1002 1.1048 1.1052 1.0896 1.0885 1.0895 1.0903 1.0952 1.0927 1.0967
irintensity: 0.3418 0.0643 0.0352 0.7289 5.3568 8.8205 8.4312 4.8081 4.5292 8.0310 2.4126 1.9665 2.0332 8.6797 0.8091 4.1904 1.7003 0.5434 0.2847 1.0447 5.3460 3.1209 13.6920 5.2805 8.2946 7.1982 0.0034 1.1056 6.6727 5.1680 25.3885 1.4683 23.7915 7.6332 11.3580 5.8897 13.4586 12.1541 2.7745 18.4508 9.1745 2.1808 16.4478 0.5518 3.2725 49.3441 25.6533 0.3790 20.6015 50.0242 2.6669 3.9050 12.0836 76.8534 3.4455 31.0676 2.5327 41.7755 18.5071 154.1262 257.7186 38.2921 3.1145 0.2012 26.1956 32.4453 40.2368 11.2413 42.5949 41.1221 11.0988 60.8717 121.3538 26.0684 753.8675 12.1771 12.7892 45.0988 24.1397 69.9660 70.9917 33.7680 27.2988 118.6041 47.5233 50.6539 9.4621 20.5285 243.9397 133.0417 7.3629 39.4910 1.5040 239.1762 180.4306 86.8989 16.0757 21.7280 457.7667 39.8769 53.4670 88.1910 103.8142 39.1785 34.9311 1.2540 33.3508 24.5628 12.9301 14.4361 5.0057 1.0133 7.0741 6.0613 8.9420 6.7622 4.8018
temp: 298.150 k
press: 1.00000 atm
elementType: 8 8 8 8 7 6 6 6 6 6 6 6 6 6 6 6 6 6 6 6 6 6 6 6 1 1 1 1 1 1 1 1 1 1 1 1 1 1 1 1 1
symmnumber: 1
zpe: 820015.0 jmol-1
zpe.correction: 0.312327 hartree
zpe.thermalcorrener: 0.336058 hartree
zpe.thermalcorrenthalpy: 0.337003 hartree
zpe.thermalcorrgfe: 0.256091 hartree
zpe.sumelectzpe: -1088.080449 hartree
zpe.sumelectthermal: -1088.056717 hartree
zpe.sumelectthermalent: -1088.055773 hartree
zpe.sumelectthermalfe: -1088.136685 hartree
dipole: -8.4909 -1.0854 -0.0213
dipole: 8.5600
quadrupole: -165.7678 -131.2781 -141.2932
quadrupole: -1.3553 -5.5055 -2.6851
quadrupole: -19.6547 14.8349 4.8198 -1.3553 -5.5055 -2.6851
hfenergy: -1088.3927758 hartree
pointgroup: C01 [X(C19H17N1O4)]
dipole: 3.3546249 0.2857766 0.0823341 debye
polarizability: 533.6390381|-7.5349282|247.2128725|10.9591818|11.3288981|107.698184 unknown
InChI: InChI=1S/C19H17NO4/c1-22-17-10-14(11-18(23-2)19(17)24-3)6-9-16(21)15-7-4-13(12-20)5-8-15/h4-11H,1-3H3
charge 0 multiplicity 1
41 atoms
O  5.462632 -1.388206 -0.033486
O  3.090095 -2.92227 -0.285261
O  5.286037 1.408279 0.238717
O  -2.051167 2.695153 0.139626
N  -8.556866 -1.31924 -0.068266
C  1.63224 0.474414 0.034776
C  4.227888 -0.732989 0.000509
C  3.050281 -1.523406 -0.178932
C  4.086675 0.684621 0.14095
C  1.776508 -0.925378 -0.155015
C  2.806082 1.271554 0.169055
C  0.3351 1.146607 0.08323
C  -0.912526 0.576344 0.009531
C  -3.488063 0.76716 0.033531
C  -2.124865 1.420875 0.067259
C  -3.694418 -0.63745 0.100832
C  -4.62204 1.620416 -0.055305
C  -4.99455 -1.17662 0.077876
C  -5.923617 1.095178 -0.083678
C  -6.120713 -0.313901 -0.017724
C  6.41364 -1.142308 1.077085
C  3.920943 -3.503618 -1.364619
C  5.191732 2.869057 0.339757
C  -7.451212 -0.863136 -0.045144
H  0.911458 -1.582791 -0.276707
H  2.693386 2.353779 0.286704
H  0.349275 2.241561 0.194102
H  -1.024092 -0.50646 -0.101301
H  -2.8482 -1.325063 0.185165
H  -4.443846 2.699581 -0.096684
H  -5.147245 -2.25876 0.134798
H  -6.791116 1.758478 -0.155293
H  7.264979 -1.806825 0.867086
H  5.945983 -1.418352 2.040291
H  6.730984 -0.088199 1.090115
H  4.977795 -3.216286 -1.245958
H  3.542969 -3.175474 -2.352054
H  3.797264 -4.592005 -1.259813
H  4.686226 3.297061 -0.546568
H  6.233304 3.219522 0.378574
H  4.658759 3.175193 1.260238
