program: Gaussian 09
title: 000260026
version: EM64L-G09RevD.01
frameworkgroup: C1[X(C9H5Cl3O3)]
method: RPBEPBE
basis: SDD
operation: Freq
keyword: #p
keyword: freq=noraman
keyword: PBEPBE/SDD
title: #p freq=noraman PBEPBE/SDD
converged: NO NO NO NO
title: Mulliken charges:
elementType: Cl Cl Cl O O O C C C C C C C C C H H H H H
charge: 0.130334 0.143308 0.122883 -0.215462 -0.358973 -0.175913 0.146119 0.401070 0.046519 -0.654577 0.128449 -0.348697 -0.350891 -0.208660 -0.211159 0.271710 0.272894 0.239818 0.378273 0.242955
chargesum: 0.00000
title: Mulliken charges with hydrogens summed into heavy atoms:
elementType: Cl Cl Cl O O O C C C C C C C C C
charge: 0.130334 0.143308 0.122883 -0.215462 0.019300 -0.175913 0.146119 0.401070 0.046519 -0.654577 0.128449 -0.076987 -0.077998 0.031158 0.031796
polarizability: 1.56018895e+02 6.22693214e+00 1.49720022e+02 -2.05187675e+01 6.45188819e+00 8.72767847e+01
1716.lowfreq: -9.6919 -6.7366 0.0016 0.0021 0.0032 8.4100 45.4255 61.5606 89.1260
frequency: 45.3930 61.5512 89.1230 135.3962 173.3023 183.2697 203.3420 229.4653 252.9558 256.8779 296.9280 308.0848 325.1564 369.0383 410.4750 419.9573 471.1753 515.9699 541.8393 570.7809 610.9616 658.9978 680.9042 713.0159 727.5313 760.7898 770.7735 787.9243 812.7202 846.0083 897.5280 972.1259 978.3611 1001.6735 1007.7244 1024.7345 1057.7013 1097.7894 1163.1649 1179.0650 1211.6936 1280.1158 1344.9543 1410.5331 1452.4121 1464.1971 1610.5985 1617.2321 1731.1534 3143.6732 3157.6592 3172.8389 3185.7259 3497.4685
redmass: 12.6849 8.4523 10.3295 5.6230 18.4176 14.6415 7.1779 12.8371 9.8823 9.0461 12.5926 4.9796 7.2112 7.5021 1.9026 3.1172 3.8014 7.6622 6.4773 7.1983 7.7610 5.3628 6.8514 7.0053 8.4928 8.4769 4.7557 1.5004 8.5570 9.1706 1.3678 1.5650 4.9991 5.6277 1.3641 2.0563 10.1784 2.2277 1.5590 1.2595 2.4585 1.4814 1.9894 6.9641 2.4604 2.7229 7.6155 7.3759 13.0165 1.0868 1.0915 1.0976 1.0976 1.0646
irintensity: 0.6951 0.1479 1.5844 0.6357 0.2636 0.9139 1.5563 0.1068 5.6175 2.1708 4.9809 9.9821 19.4428 20.5456 86.7228 16.9987 52.0717 7.3746 10.1165 10.2314 21.1854 12.3261 86.5909 64.3638 73.1954 63.6137 90.1689 48.6152 56.7331 228.0684 1.9482 12.8943 54.7302 62.0286 1.1087 18.3620 68.4421 21.0360 32.5942 11.8051 69.8183 10.8018 69.4260 2.3136 17.2818 1.8069 8.3400 8.5166 367.1101 2.1033 6.3339 11.5681 5.6272 32.1326
temp: 298.150 k
press: 1.00000 atm
elementType: 17 17 17 8 8 8 6 6 6 6 6 6 6 6 6 1 1 1 1 1
symmnumber: 1
zpe: 316351.4 jmol-1
zpe.correction: 0.120492 hartree
zpe.thermalcorrener: 0.134024 hartree
zpe.thermalcorrenthalpy: 0.134969 hartree
zpe.thermalcorrgfe: 0.079600 hartree
zpe.sumelectzpe: -1950.725019 hartree
zpe.sumelectthermal: -1950.711486 hartree
zpe.sumelectthermalent: -1950.710542 hartree
zpe.sumelectthermalfe: -1950.765911 hartree
dipole: -1.8359 -4.1441 -0.1923
dipole: 4.5367
quadrupole: -92.9478 -113.1315 -106.7678
quadrupole: 8.7592 -5.9026 -0.6594
quadrupole: 11.3345 -8.8491 -2.4854 8.7592 -5.9026 -0.6594
hfenergy: -1950.8455107 hartree
pointgroup: C01 [X(C9H5Cl3O3)]
dipole: -0.8255709 1.5787494 0.1084069 debye
dipolederiv: -0.6872284 0.2594428 -0.1378773 0.2437884 -0.2397683 0.0867571 -0.0994887 0.1003931 -0.2252234 -0.2075088 -0.0423545 -0.1398355 -0.0556968 -0.135512 -0.1295276 -0.1303455 -0.1277022 -0.6575419 -0.206298 -0.1015762 -0.0081448 -0.1137078 -0.7409878 -0.0614223 0.0333893 -0.0323821 -0.1298264 -1.21053 -0.4442618 -0.0950914 -0.4667727 -0.8191657 -0.1296822 -0.1545886 -0.0445102 -0.4060528 -0.5346783 -0.1891655 -0.0530962 -0.2385011 -0.4053323 0.0671252 -0.2105492 -0.0588382 -0.8848058 -0.5643499 -0.1697113 -0.0345482 -0.2129847 -1.2081692 -0.0583529 -0.0768594 -0.1018383 -0.2984773 0.8132822 0.1512319 -0.0537971 0.5288359 0.5971909 0.0612614 0.0753489 0.0155954 0.852711 -0.1019133 0.0587458 -0.0519941 -0.210567 0.0532829 0.0148552 0.091869 0.0235521 -0.1008573 -0.2033637 0.1653293 -0.0082019 0.2866491 -0.4825472 0.0046262 -0.0107564 -0.0095129 0.0288948 1.0009954 -0.1490704 0.4091568 -0.0877296 1.1588396 0.1045537 0.1991082 0.0962485 0.9009051 1.5326129 0.3332381 0.1860221 0.1019752 1.7806665 0.0758607 0.2874731 0.1790595 0.2930779 -0.1345723 0.1783336 0.0349649 0.117613 -0.016968 0.0173572 0.0176862 0.0441862 -0.0754344 0.0127956 -0.0289765 0.031989 0.1312792 0.0959889 0.0422898 0.0260402 0.0160825 -0.0860741 0.0396522 -0.0854017 0.0205264 -0.0645018 0.1374207 0.0233797 0.0090723 0.0117853 -0.1108823 0.1373704 -0.0595935 0.060174 -0.079051 -0.1394532 -0.010636 0.0543698 -0.0127575 -0.1278081 0.0762262 -0.0753422 -0.0382461 -0.0591209 0.0378514 -0.0145135 -0.0196134 -0.0169168 0.1412428 0.061071 -0.0314841 -0.0209057 -0.0707942 0.026324 -0.0276935 -0.0332579 -0.0201049 0.1529331 0.0563534 0.0657832 -0.0095068 0.0776567 -0.0594307 -0.0119765 -0.0124188 -0.0111209 0.1495842 0.2073454 0.1266064 -0.0474403 0.1353825 0.2715471 -0.0538721 -0.0021025 -0.0513272 0.4342134 -0.087262 0.0382264 -0.0441478 0.0362477 0.0882225 -0.0003894 -0.0443767 0.0001086 0.1494213 unknown
polarizability: 159.0738167|-5.0458792|149.0919163|15.5769876|7.3978943|84.8499683 unknown
InChI: InChI=1S/C9H5Cl3O3/c10-9(11,12)8(14)6-4-2-1-3-5(6)7(13)15-8/h1-4,14H
charge 0 multiplicity 1
20 atoms
Cl 3.658278 -0.46433 -0.03314
Cl 1.593893 -0.031843 -2.212554
Cl 2.369356 2.237429 -0.372437
O  0.82872 -1.503961 0.393262
O  1.310839 0.317146 1.876251
O  -0.874025 -3.038571 -0.100027
C  0.942661 -0.02497 0.542155
C  -0.460351 0.501172 0.262286
C  -1.304217 -0.594022 -0.016411
C  2.062183 0.403996 -0.478913
C  -0.536663 -1.861498 0.059806
C  -0.96737 1.808542 0.314647
C  -2.676099 -0.424481 -0.280361
C  -2.348056 1.990183 0.050139
C  -3.192509 0.890638 -0.2503
H  -0.325096 2.657964 0.558334
H  -3.309842 -1.290923 -0.493057
H  -2.772383 2.999282 0.082748
H  2.181569 -0.112886 2.098042
H  -4.254489 1.065834 -0.450973
