program: Gaussian 09
title: 000260018
version: EM64L-G09RevD.01
frameworkgroup: C1[X(C9H7BrN2O)]
method: RPBEPBE
basis: SDD
operation: Freq
keyword: #p
keyword: freq=noraman
keyword: PBEPBE/SDD
title: #p freq=noraman PBEPBE/SDD
converged: NO YES NO NO
title: Mulliken charges:
elementType: Br O N N C C C C C C C C C H H H H H H H
charge: -0.007613 -0.216880 -0.414544 0.006909 0.406828 0.065203 0.159516 -0.397467 -0.321468 -0.033322 -0.192305 -0.247109 -0.760262 0.319527 0.238438 0.278955 0.236601 0.238676 0.325183 0.315136
chargesum: 0.00000
title: Mulliken charges with hydrogens summed into heavy atoms:
elementType: Br O N N C C C C C C C C C
charge: -0.007613 -0.216880 -0.095017 0.006909 0.406828 0.065203 0.159516 -0.159029 -0.042513 -0.033322 0.044296 -0.008434 -0.119944
polarizability: 1.85707133e+02 4.06238473e+00 1.51942621e+02 -2.56739877e+00 4.70322218e-01 5.32558992e+01
1716.lowfreq: -9.4935 -5.1717 -0.0003 0.0001 0.0002 3.0917 19.4264 72.3188 101.8268
frequency: 19.1515 72.3151 101.8251 152.1387 177.7690 217.4290 267.7886 292.6003 427.0784 442.9432 476.8791 513.2987 527.0209 578.3226 593.1109 656.1403 664.4170 685.0366 690.8453 740.5154 775.5469 798.3885 867.3451 881.8681 884.1980 957.5062 972.0584 1004.4953 1028.3280 1045.3118 1107.5553 1136.4336 1170.4864 1196.6580 1230.9542 1254.0790 1273.0002 1291.0410 1400.8508 1418.6937 1431.1354 1465.9591 1497.4659 1552.8488 1592.4139 1605.3089 1624.5471 3065.8184 3130.0231 3145.5706 3158.2945 3162.4985 3173.5495 3481.0086
redmass: 4.6718 4.9443 8.3318 4.7711 5.7004 8.2449 4.2067 7.5241 3.4741 6.3928 6.9504 5.5939 4.4370 8.7418 3.8010 5.5984 5.1777 3.3671 1.2456 6.4362 1.6128 3.0462 2.7203 1.6321 2.0945 7.5845 1.3700 1.3380 2.3351 4.1936 1.9794 1.1693 1.1022 2.0511 1.2441 2.6009 1.9221 2.0859 9.4778 1.7744 1.3499 2.9136 2.9499 5.0729 9.4676 6.6765 6.9565 1.0599 1.0881 1.0892 1.0941 1.1061 1.1004 1.0781
irintensity: 6.9352 2.2742 3.2996 0.2736 5.0695 0.7802 0.8588 8.0913 1.2863 2.3555 0.4907 12.3561 6.7639 12.0141 9.5219 45.4556 9.7694 42.7625 19.6743 17.5560 104.0982 7.6311 5.0970 0.1450 6.3655 19.0521 3.2420 0.4498 15.3560 49.4002 26.8225 3.2730 2.8236 14.7693 47.3465 22.5794 9.3590 1.5208 15.0252 96.8162 1.1237 70.8661 121.9326 452.0549 3.5127 182.6368 77.1180 1.5190 3.7140 8.3548 5.1518 0.2791 21.2528 99.0052
temp: 298.150 k
press: 1.00000 atm
elementType: 35 8 7 7 6 6 6 6 6 6 6 6 6 1 1 1 1 1 1 1
symmnumber: 1
zpe: 377289.4 jmol-1
zpe.correction: 0.143702 hartree
zpe.thermalcorrener: 0.154464 hartree
zpe.thermalcorrenthalpy: 0.155409 hartree
zpe.thermalcorrgfe: 0.104496 hartree
zpe.sumelectzpe: -544.452805 hartree
zpe.sumelectthermal: -544.442042 hartree
zpe.sumelectthermalent: -544.441098 hartree
zpe.sumelectthermalfe: -544.492011 hartree
dipole: -0.7966 -5.9143 1.0110
dipole: 6.0528
quadrupole: -79.8554 -92.5841 -85.9865
quadrupole: -14.3413 -1.7717 0.9194
quadrupole: 6.2866 -6.4421 0.1555 -14.3413 -1.7717 0.9194
hfenergy: -544.596507 hartree
pointgroup: C01 [X(C9H7Br1N2O1)]
dipole: -0.6451475 2.2918349 0.0457804 debye
dipolederiv: -0.3754688 -0.1288338 0.0130739 -0.3860548 -0.4644147 0.0810636 0.1576747 0.1439634 -0.1439718 -0.5049292 -0.1925782 0.0045257 -0.0608784 -1.2511177 0.0700844 0.0008161 0.0451461 -0.3604002 -1.215689 0.1136039 -0.0885238 0.0639392 -0.6700636 0.0368283 -0.1188478 -0.0021528 -0.2080367 -0.9407248 -0.7704342 0.022863 -0.332305 -1.1208775 0.0485347 -0.0263713 0.0008132 -0.2707696 0.8381229 0.1321313 0.0665282 0.0480729 0.0848153 0.0056762 0.0835 0.0154855 0.0885438 -0.3819298 0.2366212 -0.0465604 0.0624205 -0.3826358 0.0337618 -0.0467092 0.0635509 -0.0045026 0.9492911 0.0870445 0.0435657 -0.3019512 1.0875006 -0.0313934 0.2397347 0.0494298 0.0738385 -0.3104064 -0.0629017 -0.0050793 0.1169137 0.1010703 -0.0021364 -0.0208415 -0.0297142 -0.1878056 0.0303005 -0.1512101 0.0249011 0.1436918 0.1217519 -0.0021026 0.0097969 -0.0279131 -0.0941825 1.1266401 0.4328656 0.0410331 0.1237815 1.6346428 -0.1119063 0.0312988 -0.0978071 0.2429853 0.1002856 0.043984 0.0221186 -0.0812226 0.2067003 -0.0306274 0.0324549 -0.014759 -0.1186648 0.0542595 0.1359229 0.0182573 0.0892798 -0.2461272 0.0151373 0.0197247 0.0184913 -0.1690125 0.0967338 0.1595478 -0.0598763 0.5573143 0.7251823 -0.2104839 -0.3092214 -0.2941297 0.1398086 0.3737269 0.0964404 -0.0332038 0.0869549 0.1944006 0.0142524 -0.0407332 0.0268252 0.2986806 0.0567015 -0.0897324 -0.0074682 -0.041796 -0.0634513 0.0093171 -0.0098017 0.0068562 0.1714188 0.1168572 0.0135623 -0.0057266 -0.066612 0.0123053 0.0020363 0.0013635 0.0112911 0.1531459 -0.00974 0.0961527 -0.0233541 0.1048345 -0.0002989 0.0210712 -0.0250344 0.0211299 0.1523589 -0.1036292 -0.0437479 -0.0262845 -0.0419241 0.0787186 0.0005918 -0.0297431 -0.0002422 0.1636071 0.0670344 -0.0472228 0.0329234 0.0152454 -0.0358013 -0.0067309 0.0666923 0.0359879 0.0907038 0.0325636 -0.0612155 0.006287 -0.0997044 -0.0123002 0.0570255 -0.0157529 0.0277473 -0.0177449 unknown
polarizability: 176.9317933|16.0882835|158.4105711|7.162059|-13.2328777|55.5632891 unknown
InChI: InChI=1S/C9H7BrN2O/c10-5-8-11-7-4-2-1-3-6(7)9(13)12-8/h1-4,11H,5H2
charge 0 multiplicity 1
20 atoms
Br 3.710109 2.353478 -0.193333
O  -0.111396 -2.859738 0.312523
N  0.809546 1.127942 0.168635
N  1.507191 -1.160607 0.357438
C  -0.551433 0.797946 0.033684
C  -0.90246 -0.583655 0.079373
C  1.759647 0.136654 0.321054
C  -1.542449 1.79664 -0.141407
C  -2.266612 -0.947106 -0.050965
C  0.154189 -1.627076 0.257761
C  -2.888209 1.409869 -0.267399
C  -3.255116 0.037296 -0.222392
C  3.212657 0.522564 0.532095
H  1.118833 2.103509 0.106208
H  -1.260104 2.855255 -0.176745
H  -2.511563 -2.013607 -0.012932
H  -3.659156 2.176037 -0.401949
H  -4.306891 -0.248753 -0.322402
H  3.860631 -0.203538 0.024862
H  3.456388 0.568088 1.605088
