program: Gaussian 09
title: 000260052
version: EM64L-G09RevD.01
frameworkgroup: C1[X(C18H20Cl2N4O)]
method: RPBEPBE
basis: SDD
operation: Freq
keyword: #p
keyword: freq=noraman
keyword: PBEPBE/SDD
title: #p freq=noraman PBEPBE/SDD
converged: YES YES NO NO
title: Mulliken charges:
elementType: Cl Cl O N N N N C C C C C C C C C C C C C C C C C C H H H H H H H H H H H H H H H H H H H H
charge: -0.054538 -0.051308 -0.221485 -0.173848 0.051916 -0.409777 -0.002489 0.483887 -0.390233 -0.386535 -0.593553 0.341267 -0.380735 0.319956 -0.409676 -0.586402 -0.585244 -0.838144 -0.401387 0.177911 0.276704 -0.284371 -0.314024 -0.322857 -0.327661 0.251723 0.251516 0.249078 0.253752 0.234949 0.237983 0.284987 0.270351 0.294917 0.267972 0.295273 0.237358 0.233253 0.231049 0.215196 0.285998 0.272369 0.224419 0.247238 0.243247
chargesum: 0.00000
title: Mulliken charges with hydrogens summed into heavy atoms:
elementType: Cl Cl O N N N N C C C C C C C C C C C C C C C C C C
charge: -0.054538 -0.051308 -0.221485 -0.173848 0.051916 -0.123778 -0.002489 0.483887 0.113005 0.116295 -0.358604 0.341267 -0.142753 0.319956 -0.124689 -0.021133 -0.021999 -0.136485 -0.186191 0.177911 0.276704 -0.012002 -0.089605 -0.075619 -0.084415
polarizability: 5.61448022e+02 -1.18881844e+01 2.69106079e+02 -5.94069901e-01 -1.20905711e+01 1.27095626e+02
1716.lowfreq: -4.5041 -2.0579 0.0010 0.0012 0.0017 4.5416 15.0356 17.3261 23.8290
frequency: 14.9860 17.2870 23.7719 28.9283 38.9687 42.6741 47.8358 65.1550 89.3280 102.2952 113.7304 127.0102 156.1063 165.9423 176.3180 188.6212 203.2395 211.0867 219.3181 222.3487 243.9800 249.8568 275.5821 335.6898 349.1725 365.7484 382.5340 401.3577 411.0760 427.7708 467.2608 489.4638 510.5752 536.6346 554.3404 591.1035 597.8027 623.7241 659.6889 667.5245 669.6897 687.5678 699.3260 705.0010 740.5158 752.1887 783.2308 789.1393 811.2836 828.7616 836.6899 854.5262 877.2100 889.5193 905.3701 933.2552 957.0625 963.2018 964.7790 986.4029 989.1070 997.7445 1005.9368 1024.7203 1035.1027 1037.1058 1041.5578 1050.3866 1061.1906 1085.5848 1106.6240 1118.9239 1136.2546 1175.3646 1212.5731 1217.6809 1221.3669 1242.0984 1253.9354 1257.1893 1264.2017 1282.1923 1293.3956 1299.8775 1305.3089 1324.0274 1337.8114 1352.0588 1354.1567 1373.6701 1394.7591 1399.3156 1400.8424 1441.5189 1458.8771 1459.9130 1460.6856 1475.1814 1478.1078 1486.6657 1500.9710 1506.1822 1516.7343 1544.3388 1546.9005 1573.6280 1582.7903 1616.5402 1626.3389 2974.5563 2983.6525 3015.9184 3021.0545 3051.9046 3063.0414 3063.3829 3071.8457 3077.2341 3085.6206 3122.9121 3140.8001 3145.9222 3147.3398 3147.6034 3148.1315 3148.3972 3168.7572 3174.2543 3375.9854
redmass: 7.9803 5.9774 10.5114 11.6026 5.5563 6.6199 5.8584 5.2923 3.8263 4.7529 3.2342 2.7873 1.1622 6.0121 5.4380 3.4379 3.3784 5.8221 4.5812 4.6661 4.2412 3.5027 4.6980 4.1517 5.7452 2.5012 4.4043 4.3281 4.8708 4.5194 3.0732 4.8372 4.2315 4.8934 4.2357 2.9536 4.4745 1.2755 6.3687 7.0587 7.2718 4.5211 5.3889 4.7610 3.1582 2.9410 1.1263 1.1923 3.9446 1.4064 1.6950 1.5101 5.1514 1.2612 5.2057 1.5200 3.1202 2.1797 1.9089 1.4470 1.3566 1.4145 1.5547 6.7179 3.7164 3.7485 1.5663 1.6358 2.1624 1.6338 2.6308 1.4676 2.8701 1.4939 1.7732 1.3481 2.0160 2.8136 1.1758 1.1870 1.5066 1.5735 1.1948 6.2089 1.4222 1.5398 1.7435 1.2507 1.4590 2.8799 1.9164 1.7242 1.5274 2.6212 1.1303 1.0972 1.8357 1.0465 1.3442 1.1532 1.6980 1.1399 2.4623 6.8802 6.5896 5.3926 5.5140 8.1849 6.4058 1.0424 1.0810 1.0601 1.0608 1.0976 1.0570 1.0578 1.1033 1.1039 1.0979 1.0876 1.0897 1.0995 1.0979 1.0973 1.1032 1.1001 1.0959 1.0965 1.0750
irintensity: 0.0182 1.6636 0.5115 0.5992 1.5069 0.1809 0.9625 0.8668 4.4420 6.6390 3.9697 1.4409 1.4081 8.6298 0.6310 4.2544 6.9355 15.4195 3.4350 5.7019 6.0102 6.6269 6.5993 9.6530 5.2346 0.3638 2.3330 3.1754 4.0721 9.5594 7.3226 1.7009 6.5883 7.6141 11.0424 1.0603 2.9858 79.8168 1.9974 64.3460 78.6074 23.9898 83.5953 20.6361 1.5167 9.2278 2.7880 9.8699 11.4929 25.4762 37.5458 23.7923 0.5291 3.7038 32.9737 28.3589 1.5919 25.5188 0.3368 2.7748 2.3523 4.4953 15.4743 20.0919 0.8885 0.6049 6.4227 11.2507 20.6577 19.4081 4.0582 46.8319 200.0315 33.1388 46.8022 21.0123 30.5254 208.5067 16.1553 24.3240 11.0241 161.9992 6.4698 0.8797 30.9831 5.2594 60.6938 1.6970 140.3560 31.8918 96.5666 22.4548 4.5797 22.0259 25.8163 7.0133 13.8863 13.6697 18.4004 29.7594 400.1115 40.9393 61.4189 39.8497 26.1456 267.7810 31.9850 304.1344 417.7572 9.3953 78.2019 22.5924 29.5834 17.8110 4.9516 24.7713 8.9670 7.3217 21.7820 12.6358 33.6514 17.0815 25.4766 13.8211 11.1602 7.3458 19.3993 6.8529 22.6187
temp: 298.150 k
press: 1.00000 atm
elementType: 17 17 8 7 7 7 7 6 6 6 6 6 6 6 6 6 6 6 6 6 6 6 6 6 6 1 1 1 1 1 1 1 1 1 1 1 1 1 1 1 1 1 1 1 1
symmnumber: 1
zpe: 921640.8 jmol-1
zpe.correction: 0.351034 hartree
zpe.thermalcorrener: 0.376001 hartree
zpe.thermalcorrenthalpy: 0.376945 hartree
zpe.thermalcorrgfe: 0.290843 hartree
zpe.sumelectzpe: -1910.410294 hartree
zpe.sumelectthermal: -1910.385328 hartree
zpe.sumelectthermalent: -1910.384384 hartree
zpe.sumelectthermalfe: -1910.470485 hartree
dipole: 3.0453 -4.5317 1.2544
dipole: 5.6021
quadrupole: -194.7793 -171.0725 -161.9965
quadrupole: 11.6101 -3.9837 1.2097
quadrupole: -18.8299 4.8770 13.9529 11.6101 -3.9837 1.2097
hfenergy: -1910.7613286 hartree
pointgroup: C01 [X(C18H20Cl2N4O1)]
dipole: 1.2124808 -1.780127 0.4678075 debye
polarizability: 561.516876|-10.3848324|269.1654404|-4.829794|-10.8785471|126.96741 unknown
InChI: InChI=1S/C18H20Cl2N4O/c1-14-12-17(24(10-6-19)11-7-20)3-2-16(14)13-22-23-18(25)15-4-8-21-9-5-15/h2-5,8-9,12-13,23H,6-7,10-11H2,1H3
charge 0 multiplicity 1
45 atoms
Cl 7.314739 -3.044224 -0.404144
Cl 6.098494 4.201598 0.026777
O  -3.77604 2.069283 -0.33518
N  4.818424 0.254458 -0.068722
N  -1.694081 0.198085 -0.017262
N  -3.038302 -0.126464 0.071775
N  -8.171956 -0.513666 0.046339
C  3.433691 0.002518 0.01717
C  5.812137 -0.776632 0.279547
C  5.337368 1.55991 -0.517449
C  2.934711 -1.281879 0.394346
C  1.555015 -1.55897 0.488577
C  2.474371 1.025269 -0.271425
C  0.609498 -0.525649 0.189773
C  1.104887 0.756452 -0.187418
C  6.075013 -1.712289 -0.916133
C  5.41307 2.556911 0.654892
C  1.11402 -2.956338 0.900106
C  -0.831076 -0.763055 0.264988
C  -4.024761 0.849619 -0.135553
C  -5.439047 0.320377 -0.070824
C  -6.468399 1.232186 0.271657
C  -5.811017 -1.014785 -0.3764
C  -7.80208 0.774907 0.323662
C  -7.1753 -1.37879 -0.305062
H  6.75781 -0.285972 0.569691
H  5.48122 -1.36444 1.153704
H  6.348839 1.420698 -0.93825
H  4.713284 1.975371 -1.327611
H  3.628915 -2.097608 0.618686
H  2.792778 2.031779 -0.556471
H  0.375706 1.542433 -0.409071
H  6.532581 -1.185246 -1.766448
H  5.170414 -2.247965 -1.237242
H  6.105035 2.222545 1.442146
H  4.425295 2.783018 1.08103
H  1.98653 -3.60596 1.081177
H  0.515516 -2.940768 1.830641
H  0.497821 -3.440836 0.119144
H  -1.169746 -1.774847 0.56436
H  -3.327981 -1.075903 0.352949
H  -6.212658 2.275153 0.480097
H  -5.079316 -1.760303 -0.708458
H  -8.617388 1.454645 0.594146
H  -7.493732 -2.39963 -0.544858
