program: Gaussian 09
title: 000260046
version: EM64L-G09RevD.01
frameworkgroup: C1[X(C22H17N3O)]
method: RPBEPBE
basis: SDD
operation: Freq
keyword: #p
keyword: freq=noraman
keyword: PBEPBE/SDD
title: #p freq=noraman PBEPBE/SDD
converged: YES YES NO NO
title: Mulliken charges:
elementType: O N N N C C C C C C C C C C C C C C C C C C C C C C H H H H H H H H H H H H H H H H H
charge: -0.233270 -0.349390 -0.046232 -0.070913 0.162119 0.468124 0.105328 0.115138 0.048641 -0.342817 -0.328256 -0.321905 -0.767566 -0.350262 0.250688 -0.368531 -0.344911 -0.244682 -0.205723 0.432233 -0.376392 -0.367653 -0.369580 -0.230929 -0.219486 -0.228077 0.253729 0.250320 0.271229 0.250818 0.247306 0.266313 0.259912 0.256844 0.245520 0.233121 0.232687 0.216897 0.227999 0.276401 0.231051 0.231571 0.232587
chargesum: 0.00000
title: Mulliken charges with hydrogens summed into heavy atoms:
elementType: O N N N C C C C C C C C C C C C C C C C C C C C C C
charge: -0.233270 -0.349390 -0.046232 -0.070913 0.162119 0.468124 0.105328 0.115138 0.048641 -0.089088 -0.077936 -0.050676 -0.003128 -0.090350 0.250688 -0.111687 -0.099392 -0.011561 0.026963 0.432233 -0.159495 -0.139654 -0.093180 0.000122 0.012084 0.004510
polarizability: 5.56827818e+02 -1.89347549e+00 1.95868867e+02 5.97921296e+00 -1.03916231e+01 1.74102512e+02
1716.lowfreq: -7.7430 -0.0005 0.0007 0.0010 1.0922 4.2998 14.8237 22.3836 23.9702
frequency: 14.6372 22.3738 23.8450 41.0273 56.7410 70.7270 100.3700 124.4065 126.5160 148.8045 157.9887 176.1215 206.6876 241.0856 265.9727 282.6005 297.0235 317.0064 349.6691 390.3096 401.7477 405.3161 414.0855 444.2916 446.5722 473.3690 506.8962 512.6922 529.7378 538.6077 546.4523 590.5488 613.9660 619.3263 623.4780 640.0822 651.3684 677.6696 692.2992 698.0741 730.7080 771.9641 784.0104 795.8352 806.1078 821.7367 834.1684 843.9763 850.5535 857.7419 871.1994 896.7780 931.3630 949.1167 969.7611 979.4924 983.5518 987.6715 988.2952 989.7996 1000.8287 1002.5871 1008.2030 1014.1729 1021.5960 1026.0666 1046.4737 1077.5613 1080.4271 1102.6352 1108.0457 1162.2689 1163.5181 1172.7077 1179.3858 1188.2203 1213.3117 1235.5345 1239.3092 1250.7414 1290.8644 1291.5577 1310.6037 1314.3600 1351.4961 1368.8785 1391.6317 1395.9147 1397.3790 1413.7217 1440.6276 1446.5042 1455.4569 1457.8334 1463.1927 1478.9002 1493.7010 1560.7291 1564.0109 1569.1661 1577.8381 1596.3488 1613.0861 1613.9278 1622.2895 1625.6314 2943.8559 2997.0557 3075.9417 3117.4252 3130.9201 3134.1215 3134.2047 3136.7140 3142.5020 3144.5979 3148.8444 3158.8005 3160.1594 3163.9333 3169.2656 3169.6514 3173.5573
redmass: 4.5033 5.5296 6.0836 3.9016 5.0945 5.9878 3.8176 5.4110 5.9433 4.0497 2.6767 1.4291 5.3647 4.3260 3.3786 4.3528 4.4515 4.8689 5.1556 5.8000 5.0111 2.8582 2.9297 5.9993 3.9604 3.6963 4.5087 4.7614 3.8989 5.6551 3.9988 5.1437 6.4119 5.0114 4.8275 5.5342 5.6931 6.7083 4.4467 1.8026 3.6878 1.7245 1.5094 3.4686 3.8990 1.9465 1.7592 3.6838 4.6065 1.2508 3.3231 1.5145 1.3714 1.4160 1.3689 1.3734 1.7018 2.3680 5.6244 1.7608 2.9019 1.3306 1.3634 2.5422 2.1340 2.1190 1.5478 3.0615 1.6009 1.8868 1.3080 1.6802 1.1565 1.0681 1.1226 1.6668 2.1850 3.2938 3.2266 2.3861 1.9031 1.3444 2.1347 2.3657 2.9690 2.6708 9.6656 1.2463 4.1229 3.8749 2.2336 1.4642 1.7210 2.6065 1.0697 2.3395 2.8235 6.8009 7.2325 7.4899 6.6157 6.0590 8.4029 6.3146 7.5144 7.5204 1.0860 1.0381 1.0969 1.0879 1.0869 1.0968 1.0882 1.0881 1.0894 1.0919 1.0900 1.0959 1.0967 1.0955 1.1004 1.0969 1.0998
irintensity: 0.5296 0.0760 0.6027 0.2241 0.2648 0.2337 4.2936 0.4180 1.9809 0.3214 1.5422 0.2222 7.2196 6.7129 12.9988 2.2710 1.5245 3.0199 4.1152 2.3003 2.0292 0.2666 3.9524 0.8768 1.0123 8.0397 7.8453 1.2633 2.0737 5.6192 13.8766 11.8435 0.4671 14.7849 2.7583 4.3241 26.8811 7.9305 12.4458 56.1947 1.8361 38.4361 77.7609 2.1562 16.4232 19.5723 16.1576 6.6131 9.9120 0.2550 17.4949 0.8154 1.6616 2.6843 1.0041 2.9416 16.7105 2.4040 3.1052 9.3870 6.6120 0.0119 3.4563 16.9558 7.8588 3.4114 3.4369 19.4257 14.7178 12.9318 13.3358 68.9264 2.9692 1.4378 15.1666 11.9047 1.6883 36.7064 30.6177 12.0559 0.8906 1.2454 47.2305 174.2007 5.6046 1.5378 32.8028 30.5615 3.2762 4.0598 16.7490 12.8047 59.9869 51.6880 26.0400 13.4693 146.0205 208.9517 25.4588 31.8312 92.6428 83.3481 269.2373 2.3742 31.5463 116.8588 49.8682 16.5154 8.6488 7.8132 0.0257 19.8336 0.2998 10.9159 11.4030 20.9358 8.3919 24.6950 8.4064 12.5416 31.4116 3.1446 28.9949
temp: 298.150 k
press: 1.00000 atm
elementType: 8 7 7 7 6 6 6 6 6 6 6 6 6 6 6 6 6 6 6 6 6 6 6 6 6 6 1 1 1 1 1 1 1 1 1 1 1 1 1 1 1 1 1
symmnumber: 1
zpe: 870792.4 jmol-1
zpe.correction: 0.331667 hartree
zpe.thermalcorrener: 0.352924 hartree
zpe.thermalcorrenthalpy: 0.353868 hartree
zpe.thermalcorrgfe: 0.278569 hartree
zpe.sumelectzpe: -1086.266359 hartree
zpe.sumelectthermal: -1086.245103 hartree
zpe.sumelectthermalent: -1086.244159 hartree
zpe.sumelectthermalfe: -1086.319457 hartree
dipole: -2.4509 2.3687 -1.0046
dipole: 3.5535
quadrupole: -113.9500 -155.9300 -142.5863
quadrupole: -3.6460 4.5542 -2.5438
quadrupole: 23.5388 -18.4412 -5.0975 -3.6460 4.5542 -2.5438
hfenergy: -1086.5980265 hartree
pointgroup: C01 [X(C22H17N3O1)]
dipole: 0.9689585 -0.9840078 -0.21762 debye
polarizability: 556.8651573|-1.3994654|198.8446734|-4.8793126|5.7900711|171.0893668 unknown
InChI: InChI=1S/C22H17N3O/c1-16-24-21-10-6-5-9-20(21)22(26)25(16)19-13-11-18(12-14-19)23-15-17-7-3-2-4-8-17/h2-15H,1H3
charge 0 multiplicity 1
43 atoms
O  -2.491307 1.906421 -0.51281
N  -2.330202 -0.357364 0.11716
N  -4.268919 -1.770437 0.364149
N  3.332186 0.246856 0.489313
C  -4.541057 0.617765 -0.266726
C  -0.881957 -0.220066 0.192939
C  -2.95542 -1.598129 0.39233
C  -3.08119 0.820884 -0.24784
C  -5.085213 -0.668534 0.045916
C  -0.255607 -0.061145 1.450182
C  -0.114569 -0.2016 -0.992171
C  -5.401553 1.699382 -0.590468
C  -2.072764 -2.778909 0.719629
C  -6.496617 -0.846981 0.029744
C  1.933805 0.064123 0.341982
C  1.141102 0.089566 1.522841
C  1.28469 -0.0641 -0.92186
C  -6.792934 1.50925 -0.601683
C  -7.338492 0.231056 -0.28956
C  5.639539 -0.093576 -0.222143
C  4.191172 -0.342877 -0.306177
C  6.518584 -0.781206 -1.103528
C  6.179072 0.825524 0.722189
C  7.910368 -0.556232 -1.045433
C  7.567899 1.047298 0.778836
C  8.4381 0.358278 -0.104086
H  -0.865039 -0.030471 2.359716
H  -0.618575 -0.272405 -1.961475
H  -4.948784 2.668454 -0.824572
H  -1.531541 -2.635469 1.671798
H  -1.309438 -2.945028 -0.061307
H  -2.715928 -3.666332 0.803351
H  -6.892518 -1.83806 0.270814
H  1.645206 0.232354 2.483336
H  1.87192 -0.011205 -1.845374
H  -7.459898 2.341652 -0.849606
H  -8.424724 0.087788 -0.299617
H  3.873002 -1.081671 -1.073761
H  6.106616 -1.490991 -1.83236
H  5.487029 1.346124 1.391856
H  8.58111 -1.089198 -1.728029
H  7.979427 1.755434 1.506549
H  9.518622 0.534373 -0.057449
