program: Gaussian 09
title: 000260027
version: EM64L-G09RevD.01
frameworkgroup: C1[X(C11H7Cl3O4)]
method: RPBEPBE
basis: SDD
operation: Freq
keyword: #p
keyword: freq=noraman
keyword: PBEPBE/SDD
title: #p freq=noraman PBEPBE/SDD
converged: YES YES NO NO
title: Mulliken charges:
elementType: Cl Cl Cl O O O O C C C C C C C C C C C H H H H H H H
charge: 0.164389 0.130587 0.111917 -0.210210 -0.230263 -0.168121 -0.200770 0.279839 0.363666 0.110408 -0.713603 0.125048 -0.363021 -0.357813 -0.207984 -0.211319 0.337752 -0.753086 0.270279 0.272284 0.238804 0.242065 0.255376 0.264189 0.249588
chargesum: 0.00000
title: Mulliken charges with hydrogens summed into heavy atoms:
elementType: Cl Cl Cl O O O O C C C C C C C C C C C
charge: 0.164389 0.130587 0.111917 -0.210210 -0.230263 -0.168121 -0.200770 0.279839 0.363666 0.110408 -0.713603 0.125048 -0.092742 -0.085529 0.030820 0.030746 0.337752 0.016067
polarizability: 1.77800046e+02 2.23683372e+01 1.25144995e+02 2.13718172e-01 1.80514079e+00 1.63005783e+02
1716.lowfreq: -6.4168 -4.6751 -0.0016 0.0008 0.0021 8.0638 45.5212 55.6895 58.3302
frequency: 45.4552 55.6839 58.3298 68.0700 89.9125 90.7066 99.9350 137.3628 184.3760 188.3543 207.2185 214.6273 247.6725 256.0668 292.3787 296.0007 311.9747 335.6441 370.8600 418.7062 469.7444 517.7628 522.1323 554.4026 556.8984 626.3097 636.9611 657.1023 703.0092 707.2090 718.6336 735.4767 775.3041 787.1152 789.2905 844.9509 876.9885 896.7303 966.7539 971.0943 983.2489 1000.9798 1005.9266 1032.5002 1042.0627 1062.4827 1104.8788 1168.1272 1176.2909 1185.3601 1237.2874 1282.9301 1386.0878 1408.0739 1450.7832 1451.5923 1452.7945 1460.5528 1610.7859 1617.4433 1686.4826 1740.3361 3009.1234 3100.1600 3142.8163 3145.7463 3157.1369 3171.9056 3181.4567
redmass: 15.0054 5.8314 3.9453 2.8917 2.8971 2.1632 7.0955 5.4168 16.2804 19.1980 16.7324 6.7326 14.9167 8.4477 9.8839 10.2622 7.5553 6.2100 26.3336 3.4346 4.7386 7.6358 4.5496 6.2951 3.9020 8.9053 11.1543 5.0432 5.0849 7.3138 6.7847 8.7676 6.2076 1.4809 8.9241 9.3275 8.4442 1.3970 7.9570 1.4729 2.2665 5.3768 1.3458 2.4119 1.6511 5.3353 2.3355 3.1594 1.1387 2.5271 3.8378 1.4612 1.2307 8.4260 1.0487 1.0572 2.4328 2.5789 7.5160 7.5144 10.5771 13.0171 1.0376 1.0955 1.0868 1.1021 1.0913 1.0966 1.0986
irintensity: 0.2918 2.1653 1.9915 2.3788 0.5747 0.5465 1.8762 0.4277 0.2338 0.2517 0.3568 1.6602 0.9519 1.2075 0.6623 1.7184 8.8508 2.3865 0.8874 0.9903 5.4739 1.5146 32.6976 5.3331 3.2278 14.6083 7.3450 11.5524 49.9524 34.2861 21.9157 93.4530 33.4052 69.7560 91.6709 312.0316 119.0537 2.2731 167.4660 2.2658 70.5332 35.2201 0.0848 16.2650 10.7651 38.0475 3.9213 244.9610 9.7713 14.7761 92.7146 2.3747 56.3408 0.5098 18.4860 22.9404 19.6449 2.7717 11.0906 3.6861 165.3924 372.0163 0.2455 3.7062 2.0568 6.3335 6.5755 8.7053 9.2021
temp: 298.150 k
press: 1.00000 atm
elementType: 17 17 17 8 8 8 8 6 6 6 6 6 6 6 6 6 6 6 1 1 1 1 1 1 1
symmnumber: 1
zpe: 411147.9 jmol-1
zpe.correction: 0.156598 hartree
zpe.thermalcorrener: 0.173864 hartree
zpe.thermalcorrenthalpy: 0.174808 hartree
zpe.thermalcorrgfe: 0.110359 hartree
zpe.sumelectzpe: -2103.145906 hartree
zpe.sumelectthermal: -2103.128640 hartree
zpe.sumelectthermalent: -2103.127696 hartree
zpe.sumelectthermalfe: -2103.192145 hartree
dipole: -1.2976 0.7311 -5.2837
dipole: 5.4896
quadrupole: -114.3853 -116.2554 -128.0791
quadrupole: 12.2222 8.0400 -2.7752
quadrupole: 5.1879 3.3179 -8.5058 12.2222 8.0400 -2.7752
hfenergy: -2103.3025043 hartree
pointgroup: C01 [X(C11H7Cl3O4)]
dipole: -0.5555985 0.1986795 -2.0776298 debye
dipolederiv: -0.6558979 -0.0804165 -0.2615234 -0.0079883 -0.1320595 -0.0284608 -0.2642356 -0.0438757 -0.2134114 -0.3341455 -0.2117895 0.1175684 -0.2133714 -0.4996127 0.1869867 0.1293776 0.1899957 -0.2070462 -0.1946263 0.0340217 0.0886403 0.0751759 -0.1787531 -0.1245445 0.0897718 -0.0702747 -0.7211699 -1.1350472 0.0411622 0.4202059 0.1263928 -0.4203738 -0.1412493 0.4105478 0.0307597 -0.7615623 -0.5473997 0.0274787 0.0793853 -0.2740414 -1.8686168 0.3490859 0.1527847 0.1966213 -0.3588151 -0.5460056 0.0223423 0.1678752 0.0320742 -0.2980801 -0.1694543 0.2088164 -0.1607562 -1.1671645 -0.6997245 0.3487669 0.0976285 -0.1236491 -0.7642479 0.0707849 0.1843852 -0.1168223 -0.2730587 0.7017439 0.1918813 -0.0800966 -0.0467794 1.02692 -0.0823307 -0.3607996 -0.2669759 0.6183908 -0.1320421 -0.0237849 -0.0517383 0.1551069 -0.1079752 0.0398886 0.1445194 0.0431288 0.0245138 -0.2221603 -0.043982 -0.1650656 -0.0394063 0.0294318 -0.0760896 -0.2579489 -0.0907087 -0.4633961 1.1293744 0.3162325 0.0611498 0.1569646 0.8038778 -0.0386954 0.0348251 -0.0678487 1.1819193 1.5317585 -0.0480529 -0.3538659 -0.0036737 0.2849581 0.2950724 -0.1495291 0.2927323 1.743931 -0.1338291 -0.0361677 -0.1754209 -0.0319614 -0.104384 0.0227976 -0.0979163 0.0172225 -0.0233652 0.0480873 0.0057046 0.0160395 -0.040393 -0.0821682 0.0326621 -0.1344149 0.0371192 0.0984886 0.0433161 0.0202407 0.0781077 0.0042262 -0.1040967 0.0427451 0.0721783 0.0343448 0.133733 0.1479523 0.0072127 0.0581354 0.0114861 -0.1384881 -0.0041971 0.0701212 -0.0004952 -0.1374671 0.9658907 -0.4317772 -0.1936294 0.3545979 2.0199188 -0.3552492 -0.3438266 -0.0057878 0.307827 -0.2864543 -0.2051148 0.1174424 -0.1794417 -0.189466 0.0833212 0.0793408 0.060415 -0.0229672 0.0645304 0.0025361 0.0860949 0.0111636 0.1414583 -0.0275581 0.0588905 -0.0207792 0.0402278 0.0550392 0.0056179 0.0339352 0.0118147 0.1544717 -0.0237891 0.0740036 -0.0226568 0.028212 0.0541298 -0.010382 -0.0606926 -0.0143197 0.1454353 -0.0347897 -0.0754115 -0.0354015 -0.0574701 -0.0962963 -0.0062841 -0.0361546 -0.002415 0.154635 -0.0104881 -0.0352064 -0.0122743 0.0901009 0.1214484 0.022316 0.0295885 0.0220943 0.0636345 -0.0879603 0.0676822 -0.0439869 0.002465 0.0515186 -0.0139093 -0.0687303 -0.0072455 0.1159524 0.030419 -0.0826904 0.007272 0.0303933 0.0688392 0.0661472 -0.0048794 0.0235888 -0.0523715 0.0510928 0.0247347 0.0490328 0.1066912 unknown
polarizability: 185.4181767|6.3494611|118.2447897|-1.4624007|5.8445303|162.2878579 unknown
InChI: InChI=1S/C11H7Cl3O4/c1-6(15)17-10(11(12,13)14)8-5-3-2-4-7(8)9(16)18-10/h2-5H,1H3
charge 0 multiplicity 1
25 atoms
Cl 3.235458 -1.279518 0.796659
Cl 0.690085 -2.895159 0.683556
Cl 1.950471 -1.862057 -1.864887
O  0.631767 0.131213 1.488797
O  1.590081 0.851028 -0.58934
O  -1.12114 0.425238 3.021035
O  0.063342 2.578779 -0.118373
C  0.758861 -0.166071 0.056127
C  -0.676417 -0.261134 -0.461136
C  -1.55402 -0.065298 0.624921
C  1.619522 -1.474165 -0.069221
C  -0.778882 0.194934 1.859099
C  -1.169945 -0.476337 -1.757103
C  -2.950053 -0.087924 0.465014
C  -2.577076 -0.500984 -1.930101
C  -3.458184 -0.314285 -0.834969
C  1.160206 2.214932 -0.570243
C  2.25268 3.073406 -1.155192
H  -0.499949 -0.619459 -2.608377
H  -3.609668 0.073381 1.323128
H  -2.990806 -0.666935 -2.930529
H  -4.540002 -0.339012 -1.001865
H  2.668854 2.612073 -2.065324
H  3.076584 3.161196 -0.423955
H  1.857433 4.075758 -1.374124
