program: Gaussian 09
title: 000260003
version: EM64L-G09RevD.01
frameworkgroup: C1[X(C9H14O4)]
method: RPBEPBE
basis: SDD
operation: Freq
keyword: #pfreq=noraman
keyword: PBEPBE/SDD
title: #p freq=noraman PBEPBE/SDD
converged: YES YES NO NO
title: Mulliken charges:
elementType: O O O O C C C C C C C C C H H H H H H H H H H H H H H
charge: -0.442078 -0.223034 -0.416951 -0.230025 0.295983 -0.472060 -0.455287 -0.428693 -0.415356 -0.382907 -0.557001 0.135221 0.179233 0.249750 0.185756 0.198951 0.225699 0.254426 0.192982 0.198744 0.220611 0.180718 0.206984 0.256200 0.284353 0.378934 0.378846
chargesum: 0.00000
title: Mulliken charges with hydrogens summed into heavy atoms:
elementType: O O O O C C C C C C C C C
charge: -0.063143 -0.223034 -0.038105 -0.230025 0.295983 -0.036553 -0.030637 0.018715 0.004000 0.004795 -0.016448 0.135221 0.179233
polarizability: 1.17195210e+02 3.22203471e-01 9.60209301e+01 -3.04609114e+00 -3.14685290e+00 9.85056044e+01
1716.lowfreq: -14.5151 -3.3924 -0.0011 -0.0010 -0.0009 10.3602 35.7565 63.8427 81.2813
frequency: 35.7448 63.8407 81.2747 105.3146 123.9300 171.0019 229.6877 255.5034 285.8408 308.2488 317.6125 356.0909 401.7318 440.6141 479.7359 496.6280 519.2172 566.7586 579.1206 638.4606 645.7203 684.2757 731.2485 781.1831 805.0345 839.6583 861.5972 865.4425 925.1132 932.7214 963.3439 969.1415 1025.4266 1052.4199 1064.3579 1069.6634 1106.3187 1110.5878 1145.7613 1161.5821 1185.9474 1229.0298 1251.3060 1259.8287 1267.8524 1280.9306 1315.5950 1321.3753 1339.4504 1343.5692 1345.2842 1359.5236 1364.0004 1424.3263 1457.2288 1460.4216 1469.3129 1471.2664 1477.2860 1656.9926 1668.0652 2959.4264 2963.6750 2968.4195 2980.7317 2995.2816 3006.8628 3029.9889 3034.4991 3043.4973 3054.5657 3062.6971 3069.5199 3511.0987 3521.2836
redmass: 8.4551 6.7888 6.8019 3.7216 5.1602 2.8738 3.6588 2.0327 4.8641 3.5066 3.0848 1.8257 4.0340 3.2432 2.1312 1.8093 2.7981 3.0084 1.4568 1.5941 2.2720 4.0504 4.3652 1.5163 2.6553 2.3860 2.3021 2.5873 2.0817 1.5886 2.2427 2.3742 2.6120 2.1056 1.9687 1.9996 1.7433 1.6913 1.6791 1.8699 1.6362 1.4477 1.5118 1.5248 1.4056 1.2963 1.5565 1.5939 1.4584 1.4429 1.5229 1.4623 1.7208 1.0905 1.0837 1.0926 1.0834 1.0838 1.0929 8.6555 8.4085 1.0642 1.0649 1.0635 1.0620 1.0645 1.0601 1.0958 1.0979 1.1032 1.0948 1.0992 1.0998 1.0639 1.0640
irintensity: 0.3043 0.2287 1.6386 0.6784 0.6252 0.4666 3.7244 0.5762 2.8857 2.9270 1.9551 1.5912 0.4665 0.5652 3.3487 16.2596 41.8854 19.4964 126.2611 67.6483 91.6064 27.2837 14.3054 0.2559 2.1519 1.9166 1.9068 1.9735 8.8593 14.6128 73.7013 51.4787 186.3553 106.7525 179.1546 25.4494 2.8357 3.4005 3.2041 7.0462 2.4485 1.6239 3.0533 5.1285 3.8816 4.8623 6.2850 14.6563 13.9008 5.9190 22.7932 2.5209 31.1500 27.3521 7.6782 3.3883 11.2335 22.4765 12.9556 33.8886 335.5839 37.8798 10.0581 49.2715 26.1642 48.9886 11.8860 62.4130 40.1057 37.9016 13.3000 3.3899 38.4548 24.3386 27.1520
temp: 298.150 k
press: 1.00000 atm
elementType: 8 8 8 8 6 6 6 6 6 6 6 6 6 1 1 1 1 1 1 1 1 1 1 1 1 1 1
symmnumber: 1
zpe: 582264.9 jmol-1
zpe.correction: 0.221773 hartree
zpe.thermalcorrener: 0.234702 hartree
zpe.thermalcorrenthalpy: 0.235646 hartree
zpe.thermalcorrgfe: 0.182137 hartree
zpe.sumelectzpe: -651.256529 hartree
zpe.sumelectthermal: -651.243601 hartree
zpe.sumelectthermalent: -651.242656 hartree
zpe.sumelectthermalfe: -651.296166 hartree
dipole: -0.3853 -1.1235 2.4077
dipole: 2.6847
quadrupole: -70.9819 -73.0245 -83.2468
quadrupole: -0.9374 2.0127 4.4369
quadrupole: 4.7692 2.7265 -7.4957 -0.9374 2.0127 4.4369
hfenergy: -651.4783023 hartree
pointgroup: C01 [X(C9H14O4)]
dipole: -0.0794277 -0.349341 0.993645 debye
polarizability: 116.703031|0.1782966|95.4367399|-4.2016134|-2.9113395|99.581974 unknown
InChI: InChI=1S/C9H14O4/c10-7(11)6-9(8(12)13)4-2-1-3-5-9/h10,12H,1-6H2
charge 0 multiplicity 1
27 atoms
O  -0.720965 2.157873 0.491618
O  0.454393 1.673866 -1.440193
O  -3.432589 -1.183006 0.80626
O  -2.488208 -0.08055 -1.001715
C  0.169248 -0.097718 0.306026
C  0.574375 -1.167077 -0.754091
C  1.295377 0.02682 1.395547
C  2.007528 -1.00176 -1.314761
C  2.703113 0.238678 0.796854
C  3.06151 -0.897441 -0.189779
C  -1.137144 -0.513022 1.035486
C  -0.004967 1.280658 -0.348143
C  -2.367278 -0.549548 0.151212
H  -0.15595 -1.155043 -1.582844
H  0.497339 -2.157999 -0.258629
H  1.293634 -0.919078 1.976586
H  1.036965 0.842059 2.097883
H  2.045532 -0.094396 -1.942956
H  2.235384 -1.864825 -1.970014
H  3.443265 0.284266 1.618999
H  2.751107 1.212171 0.269393
H  3.114516 -1.857695 0.366108
H  4.064339 -0.722608 -0.624291
H  -1.007354 -1.509909 1.495464
H  -1.354882 0.191325 1.86049
H  -0.808482 3.036277 0.032566
H  -4.235308 -1.165719 0.216924
