program: Gaussian 09
title: 000259998
version: EM64L-G09RevD.01
frameworkgroup: C1[X(C15H12N2O)]
method: RPBEPBE
basis: SDD
operation: Freq
keyword: #p
keyword: freq=noraman
keyword: PBEPBE/SDD
title: #p freq=noraman PBEPBE/SDD
converged: YES YES NO NO
title: Mulliken charges:
elementType: O N N C C C C C C C C C C C C C C C H H H H H H H H H H H H
charge: -0.268567 -0.130661 -0.129881 0.316295 0.453262 -0.510131 0.097500 0.300877 -0.365897 0.121653 -0.396207 -0.212224 -0.812004 -0.365008 -0.348589 -0.221246 -0.224237 -0.231601 0.256982 0.275804 0.236259 0.232860 0.226141 0.239367 0.229015 0.254860 0.274804 0.231838 0.234615 0.234118
chargesum: 0.00000
title: Mulliken charges with hydrogens summed into heavy atoms:
elementType: O N N C C C C C C C C C C C C C C C
charge: -0.268567 -0.130661 -0.129881 0.316295 0.453262 -0.253149 0.097500 0.300877 -0.090093 0.121653 -0.159948 0.020636 -0.117481 -0.110148 -0.073785 0.010592 0.010378 0.002518
polarizability: 3.33487351e+02 7.21009953e+00 1.89743352e+02 1.89982897e-02 2.48683739e-01 7.32727644e+01
1716.lowfreq: -13.9981 -0.0008 -0.0006 0.0001 2.6069 8.7672 9.2336 30.0225 41.6614
frequency: -11.7107 29.8516 41.6532 57.8529 90.3332 118.6208 146.2179 207.8815 233.4725 245.1872 302.2065 319.8422 394.0218 401.7204 408.3227 433.9721 487.4716 502.9691 527.8387 538.9981 614.0767 663.7033 666.6938 688.6776 692.7858 698.2378 707.3840 780.0324 809.1134 835.6762 859.6525 887.6703 898.0143 903.6737 937.4407 941.7713 955.3865 980.6022 988.2219 989.2130 990.1213 997.7989 1003.8412 1005.8596 1026.1452 1050.5122 1053.0935 1086.2971 1104.3713 1175.4256 1179.5015 1185.3724 1190.6254 1232.9734 1276.1866 1312.5371 1325.4695 1383.7497 1385.7434 1398.6590 1401.4679 1434.4837 1451.4128 1470.8293 1473.3015 1474.7894 1518.7443 1533.2136 1587.1165 1594.3754 1617.8141 1620.8027 2978.4906 3060.5888 3089.0065 3126.6152 3132.5791 3143.7605 3143.8445 3149.1085 3155.9626 3165.7835 3170.6585 3174.4278
redmass: 1.0221 3.6154 4.8882 4.8334 8.5126 5.2268 4.8356 3.1189 5.3119 6.1500 3.5755 6.2070 8.5398 2.8294 4.4277 2.8800 3.7307 5.9319 5.8481 4.4748 6.4688 7.0003 6.8556 6.8148 4.3247 1.9084 2.2914 1.8734 1.5122 5.6835 1.2477 12.5969 11.3013 1.3462 1.4097 1.4213 8.3082 2.9535 6.0608 6.3005 1.3819 1.3573 2.1241 1.3307 2.4274 1.6650 2.5168 1.6559 1.5522 1.0563 1.7109 1.2254 1.1953 3.4979 4.9137 1.3500 1.3923 8.0595 8.3394 1.2245 2.6016 2.4872 2.5175 1.2992 2.1123 1.0815 4.9632 6.1333 6.2353 5.8674 6.0422 6.1465 1.0386 1.0953 1.0998 1.0880 1.0854 1.0904 1.0902 1.0924 1.0932 1.0965 1.0983 1.1012
irintensity: 0.7636 0.1098 1.3908 0.6634 0.8155 0.0473 0.3077 3.0839 0.0275 0.1759 2.3790 0.1067 0.2914 0.0070 2.4264 4.7995 2.9069 2.5831 0.5134 2.5933 0.0146 6.4330 1.1829 14.2834 1.7236 37.0643 74.6060 34.7612 43.4225 11.4309 0.0412 3.8061 39.0581 3.0898 2.4232 8.5938 7.0052 11.1078 0.0410 0.0275 0.0429 0.4345 0.3858 0.4336 5.0993 12.8228 16.1846 3.9555 10.9142 0.0351 0.1302 2.5340 4.1932 2.2048 1.3542 0.6049 2.2791 0.1023 0.7408 13.4844 50.8140 60.3766 52.9191 49.0272 30.9473 16.6534 35.9680 9.2415 0.2539 9.1420 1.0915 3.5068 29.9791 20.4883 16.6623 8.2572 0.2471 12.1630 3.8879 19.4198 19.2275 13.2296 10.7919 18.4935
temp: 298.150 k
press: 1.00000 atm
elementType: 8 7 7 6 6 6 6 6 6 6 6 6 6 6 6 6 6 6 1 1 1 1 1 1 1 1 1 1 1 1
symmnumber: 1
zpe: 604233.3 jmol-1
zpe.correction: 0.230140 hartree
zpe.thermalcorrener: 0.244114 hartree
zpe.thermalcorrenthalpy: 0.245058 hartree
zpe.thermalcorrgfe: 0.187595 hartree
zpe.sumelectzpe: -762.263691 hartree
zpe.sumelectthermal: -762.249717 hartree
zpe.sumelectthermalent: -762.248773 hartree
zpe.sumelectthermalfe: -762.306236 hartree
dipole: -0.6037 4.2052 0.0444
dipole: 4.2486
quadrupole: -74.2413 -103.6829 -109.9215
quadrupole: 1.7095 -0.2290 0.1590
quadrupole: 21.7073 -7.7343 -13.9729 1.7095 -0.2290 0.1590
hfenergy: -762.4938312 hartree
pointgroup: C01 [X(C15H12N2O1)]
dipole: 0.205311 -1.6588085 0.0130686 debye
polarizability: 333.7132583|4.4115585|189.5179419|-0.0233974|0.0601138|73.272267 unknown
InChI: InChI=1S/C15H12N2O/c1-11-6-5-9-13(10-11)15-17-16-14(18-15)12-7-3-2-4-8-12/h2-10H,1H3
charge 0 multiplicity 1
30 atoms
O  -0.244497 -0.103069 0.000877
N  0.311079 2.110997 0.013335
N  -1.118407 2.005421 0.014203
C  2.188706 0.423447 0.001081
C  3.873232 -1.377411 -0.010811
C  2.522255 -0.95656 -0.006706
C  0.79839 0.861773 0.004766
C  -2.726918 0.060284 0.000851
C  3.218512 1.404264 0.001128
C  -1.416534 0.698598 0.005012
C  4.889347 -0.386623 -0.015237
C  4.563131 0.990378 -0.007606
C  4.223903 -2.854977 0.012106
C  -2.854306 -1.354999 -0.010422
C  -3.892758 0.875865 0.008024
C  -4.135038 -1.944941 -0.014654
C  -5.167148 0.277099 0.003799
C  -5.293842 -1.133385 -0.007603
H  1.718814 -1.701529 -0.010081
H  2.946794 2.464293 0.004725
H  5.941416 -0.695954 -0.02552
H  5.361921 1.739652 -0.012326
H  5.227278 -3.039162 -0.409269
H  4.224163 -3.245483 1.048147
H  3.496021 -3.453682 -0.563292
H  -1.954781 -1.978561 -0.01585
H  -3.777809 1.964381 0.016686
H  -4.230199 -3.036008 -0.02346
H  -6.062586 0.907676 0.009334
H  -6.287237 -1.595083 -0.010935
