program: Gaussian 09
title: 000260019
version: EM64L-G09RevD.01
frameworkgroup: C1[X(C16H17N3O6)]
method: RPBEPBE
basis: SDD
operation: Freq
keyword: #p
keyword: freq=noraman
keyword: PBEPBE/SDD
title: #p freq=noraman PBEPBE/SDD
converged: YES YES NO NO
title: Mulliken charges:
elementType: O O O O O O N N N C C C C C C C C C C C C C C C C H H H H H H H H H H H H H H H H H
charge: -0.260088 -0.259503 -0.243949 -0.376555 -0.464649 -0.212930 -0.146326 -0.465105 -0.399948 -0.355301 -0.355867 -0.392913 -0.571288 0.208717 0.211471 -0.081034 0.544143 -0.295267 0.147615 -0.563556 -0.326977 0.198889 0.144389 -0.376840 0.104848 0.236670 0.202138 0.242563 0.214068 0.260580 0.222155 0.222824 0.241247 0.251524 0.312672 0.360320 0.257523 0.280323 0.314895 0.223945 0.359691 0.384885
chargesum: 0.00000
title: Mulliken charges with hydrogens summed into heavy atoms:
elementType: O O O O O O N N N C C C C C C C C C C C C C C C C
charge: -0.260088 -0.259503 -0.243949 -0.016864 -0.079763 -0.212930 -0.146326 -0.152433 -0.039628 0.083507 0.100764 0.089822 -0.107217 0.208717 0.211471 0.170490 0.544143 -0.037745 0.147615 -0.283232 -0.012082 0.198889 0.144389 -0.152895 0.104848
polarizability: 3.53894516e+02 3.23563710e+00 2.11676930e+02 3.19915499e+01 -9.46381339e-01 1.23524758e+02
1716.lowfreq: -4.6065 -1.7224 -0.0013 -0.0012 -0.0008 2.0922 10.6227 14.2731 20.8848
frequency: 10.5728 13.9465 20.8258 31.8723 37.2067 48.1646 61.3814 82.0339 96.0719 109.0088 116.3583 127.5407 135.0573 171.9489 191.8340 203.0128 212.0804 278.1347 294.0171 326.4858 330.9688 363.0688 373.4278 380.5348 390.5774 394.3711 400.9321 423.3859 431.5924 501.2944 510.4147 516.1440 528.8299 548.9355 591.3798 592.9540 608.4969 614.3492 649.6376 684.0814 690.0122 698.9499 704.4588 733.3545 741.8885 754.9861 764.3238 768.3665 773.6346 792.8330 796.6722 805.8240 826.8388 883.1303 907.2120 923.9197 943.0505 945.6143 951.3465 981.2901 981.9647 1026.5844 1036.9019 1056.5180 1079.3681 1089.3369 1095.5630 1147.2005 1162.3956 1169.4219 1172.5246 1192.0916 1207.0890 1241.4688 1250.6230 1255.4621 1265.3324 1288.8867 1293.8208 1296.6297 1310.0295 1316.2510 1328.7737 1348.3114 1357.4976 1368.2846 1375.2926 1375.8779 1411.9750 1420.3961 1444.4646 1458.7239 1470.2556 1484.5793 1494.1162 1519.3549 1597.6018 1602.3127 1618.7517 1623.1989 1645.5038 1659.9775 1666.2261 2969.5302 2976.0787 2989.5670 3014.4247 3021.1132 3034.0726 3061.3055 3088.9300 3120.2939 3155.1032 3163.0116 3193.4575 3216.7978 3523.6949 3529.2651 3535.4399 3552.1297
redmass: 6.7013 6.4795 6.8516 6.4353 10.0530 7.1064 6.9285 3.2700 3.5500 2.9163 4.3372 4.6212 3.5278 8.1088 5.5643 6.8028 5.0391 6.3403 7.5510 2.9858 4.4353 7.4207 6.3077 5.9625 6.9452 3.7850 1.1486 2.9974 3.6817 4.9522 5.1362 6.3723 4.3069 2.3169 2.5779 2.0950 4.0673 4.7254 1.2286 2.9038 5.5569 4.4258 2.3538 3.5086 1.3861 4.0163 4.3572 1.9663 2.1790 4.4183 2.0846 1.9501 1.5029 3.7850 1.7826 1.5882 2.7543 1.3874 6.4144 1.3437 3.7682 3.1900 2.2947 4.3862 2.6622 1.7162 1.6796 1.4438 1.6205 1.2544 3.7126 1.8769 2.4490 1.3111 1.6928 1.7614 1.7311 1.2698 1.1629 1.9022 2.3123 2.2892 1.6579 1.4192 1.5644 1.4244 2.0061 2.7636 6.6388 3.1687 1.0988 1.1186 1.0778 1.0977 3.0323 2.2616 7.3171 5.4976 4.8726 6.0415 9.6920 8.6331 5.9781 1.0593 1.0612 1.0602 1.0635 1.0979 1.0990 1.1034 1.1047 1.0908 1.0918 1.0917 1.0950 1.0971 1.0770 1.0765 1.0642 1.0659
irintensity: 0.3336 1.1307 1.5151 0.6248 1.3760 6.0292 4.0884 1.1563 0.1938 0.4198 0.8686 3.3176 4.7968 5.5218 4.3012 8.4947 0.0670 9.7409 2.4591 10.2766 8.5215 10.2360 10.0549 4.6251 2.3120 6.1622 129.3235 1.1101 21.8650 16.2085 13.3995 8.5751 29.4403 3.2888 61.6598 123.7499 18.4506 31.1592 34.7839 20.8619 2.9221 16.4811 5.5051 5.9566 7.2851 9.3034 7.9503 35.1429 23.1310 13.8343 4.1003 111.9947 53.5156 17.9603 5.5983 30.5701 2.7710 2.1161 37.4784 9.3793 205.0983 1.7096 0.2848 6.5465 4.7278 163.0038 35.4805 195.6785 17.1757 29.6130 1.5640 92.3697 53.2963 70.5840 14.3291 19.8137 8.6491 7.8901 22.3045 65.0772 130.0549 82.0106 58.8314 45.1789 7.9742 9.5571 33.8219 40.2212 6.1651 94.2604 13.2007 16.0371 1.8268 24.1456 587.0146 129.4782 2.6809 10.5088 176.6413 44.1015 248.4002 364.6474 795.3838 9.0517 7.5096 34.4513 31.2360 10.2741 2.5898 35.0626 14.6854 15.6228 6.3304 4.7427 10.1974 0.9161 55.7166 13.7146 43.9749 49.1055
temp: 298.150 k
press: 1.00000 atm
elementType: 8 8 8 8 8 8 7 7 7 6 6 6 6 6 6 6 6 6 6 6 6 6 6 6 6 1 1 1 1 1 1 1 1 1 1 1 1 1 1 1 1 1
symmnumber: 1
zpe: 838234.1 jmol-1
zpe.correction: 0.319266 hartree
zpe.thermalcorrener: 0.342972 hartree
zpe.thermalcorrenthalpy: 0.343916 hartree
zpe.thermalcorrgfe: 0.260723 hartree
zpe.sumelectzpe: -1233.733043 hartree
zpe.sumelectthermal: -1233.709338 hartree
zpe.sumelectthermalent: -1233.708394 hartree
zpe.sumelectthermalfe: -1233.791586 hartree
dipole: 1.5417 -2.5909 -0.9370
dipole: 3.1571
quadrupole: -220.4632 -132.8692 -149.1219
quadrupole: 8.6872 -1.0661 -4.0235
quadrupole: -52.9785 34.6156 18.3629 8.6872 -1.0661 -4.0235
hfenergy: -1234.0523098 hartree
pointgroup: C01 [X(C16H17N3O6)]
dipole: 0.61625 0.6845801 0.8333117 debye
polarizability: 352.5863472|15.727488|188.9987088|-32.936834|38.176594|147.511148 unknown
InChI: InChI=1S/C16H17N3O6/c20-12-5-4-10(9-11(12)15(23)24)17-13(21)3-1-2-7-19-8-6-14(22)18-16(19)25/h4-6,8-9,17-18,20,23H,1-3,7H2
charge 0 multiplicity 1
42 atoms
O  1.126916 1.770677 1.122835
O  -5.090682 -0.638138 -2.139185
O  -9.00395 -1.368952 0.328014
O  7.653749 1.116377 0.060502
O  6.055207 -2.657946 -1.241068
O  8.000337 -1.421147 -0.990579
N  -5.309287 0.44331 -0.058695
N  2.132862 -0.149746 0.223713
N  -7.035457 -0.960132 -0.868092
C  -2.834292 0.116582 0.296771
C  -1.448618 0.777688 0.139453
C  -3.959063 1.04398 -0.212539
C  -0.303307 -0.153331 0.597678
C  1.038437 0.588835 0.670019
C  -5.768312 -0.407282 -1.100159
C  -6.067997 0.658546 1.088263
C  3.509653 0.222317 0.205891
C  -7.304242 0.092986 1.287734
C  -7.883953 -0.787004 0.274301
C  4.438869 -0.721743 -0.280729
C  3.978115 1.489187 0.651308
C  5.829587 -0.447615 -0.339897
C  6.290701 0.827248 0.110193
C  5.352552 1.771999 0.597995
C  6.757795 -1.482897 -0.862803
H  -2.873156 -0.830983 -0.273588
H  -3.010352 -0.132422 1.362965
H  -1.390191 1.709012 0.733792
H  -1.287003 1.064272 -0.918584
H  -3.811015 1.249039 -1.286581
H  -3.95047 2.006002 0.332212
H  -0.241057 -1.041655 -0.061178
H  -0.528813 -0.525796 1.618158
H  -5.613088 1.322526 1.829184
H  1.929363 -1.086669 -0.132314
H  -7.392318 -1.570509 -1.610629
H  -7.880167 0.286199 2.1928
H  4.10732 -1.704677 -0.630344
H  3.263424 2.223012 1.027601
H  5.707551 2.751715 0.943522
H  7.82509 2.031178 0.40171
H  6.723362 -3.310849 -1.58145
