program: Gaussian 09
title: 000023581
version: EM64L-G09RevD.01
frameworkgroup: C1[X(C12H14O3)]
method: RPBEPBE
basis: SDD
operation: Freq
keyword: #pfreq=noraman
keyword: PBEPBE/SDD
title: #p freq=noraman PBEPBE/SDD
converged: YES YES NO NO
title: Mulliken charges:
elementType: O O O C C C C C C C C C C C C H H H H H H H H H H H H H H
charge: -0.281538 -0.444398 -0.256404 0.037715 0.377772 0.346900 0.280063 -0.525404 -0.533950 -0.798810 -0.823027 -0.338489 0.092327 -0.044413 -0.552710 0.280415 0.275873 0.250022 0.226611 0.223504 0.226484 0.257360 0.235815 0.218507 0.210777 0.234910 0.382700 0.222874 0.218516
chargesum: 0.00000
title: Mulliken charges with hydrogens summed into heavy atoms:
elementType: O O O C C C C C C C C C C C C
charge: -0.281538 -0.061698 -0.256404 0.037715 0.377772 0.346900 0.280063 -0.244989 -0.258077 -0.098674 -0.103368 0.090795 0.092327 0.190496 -0.111321
polarizability: 2.20431607e+02 4.65642492e+00 1.47032801e+02 5.13710547e+00 -2.79905568e+00 7.31380075e+01
1716.lowfreq: -0.0005 -0.0004 0.0006 3.1742 6.2871 11.4062 26.9154 36.2037 51.7224
frequency: 26.5200 36.0682 51.5167 60.9595 71.0668 101.5586 147.0740 156.1194 159.0687 168.1869 230.6101 240.2332 273.0858 289.2089 329.1188 389.2120 400.7221 422.0650 506.4518 513.3155 539.7444 542.8784 572.5744 599.7648 614.8544 621.2881 724.5836 742.2559 776.3310 887.9584 913.3716 917.5043 931.7444 944.1047 951.9560 960.4333 972.1821 989.8331 1010.4417 1038.3523 1049.8119 1050.7092 1056.1734 1121.7725 1143.1702 1178.2660 1212.1290 1245.1944 1270.5795 1280.7081 1336.2545 1350.0523 1379.3077 1397.1937 1401.3331 1420.0518 1427.6649 1439.5031 1459.3449 1469.9940 1474.8035 1482.7760 1491.2367 1589.5823 1612.0076 1641.1704 1664.2790 2951.7583 2976.9969 2985.0860 3022.4976 3060.7055 3063.7601 3092.4441 3094.8909 3098.0402 3122.0019 3145.1223 3165.2094 3202.6682 3531.0800
redmass: 3.5812 3.1012 1.7399 5.0262 1.6312 2.7713 3.9803 2.0052 1.4824 3.5780 3.0604 3.2002 2.9540 4.1670 4.1643 5.2347 5.1107 2.7240 3.0271 3.6010 5.1419 2.5241 3.6918 1.9101 1.8445 2.3904 5.2284 3.9579 4.3385 3.6565 3.1837 1.3598 1.4783 2.0423 2.9403 1.4640 1.7176 1.6839 1.2327 1.8323 1.5738 1.5532 2.2790 2.0298 1.6040 2.5473 1.2757 1.4184 2.1083 1.2515 1.7593 2.4395 6.4035 1.2612 1.2824 2.8705 1.4742 1.6937 1.0516 1.0647 1.1323 1.2290 1.2156 8.3409 5.8689 8.6086 4.7729 1.0598 1.0404 1.0373 1.1017 1.0926 1.0964 1.0607 1.0999 1.1004 1.0946 1.0922 1.0923 1.1144 1.0641
irintensity: 0.1062 1.3437 1.0811 0.8429 0.7599 0.8227 1.6467 1.5870 2.0585 1.0521 0.4325 1.0382 7.2759 3.8281 2.1137 10.8984 0.5535 2.4308 2.2025 14.3739 5.3447 45.3911 12.1291 51.9746 64.9264 32.0865 28.0313 7.0970 15.1436 72.2460 11.2368 2.0212 14.1878 131.5736 19.9122 52.0495 19.4191 54.4382 14.7624 2.1641 11.8668 4.7494 216.7013 318.1363 1.5007 65.5293 2.5213 3.8669 1.5841 0.6383 141.2237 64.7887 8.0340 14.9209 10.5240 21.1854 11.1223 13.5979 8.9411 25.6425 6.6998 18.1027 43.7707 34.0186 47.0189 301.5053 3.4511 36.1753 25.6095 25.1106 31.6963 18.2935 20.5458 11.5579 17.6562 10.8079 8.0802 1.6077 0.9881 24.8520 46.3212
temp: 298.150 k
press: 1.00000 atm
elementType: 8 8 8 6 6 6 6 6 6 6 6 6 6 6 6 1 1 1 1 1 1 1 1 1 1 1 1 1 1
symmnumber: 1
zpe: 604004.4 jmol-1
zpe.correction: 0.230053 hartree
zpe.thermalcorrener: 0.246068 hartree
zpe.thermalcorrenthalpy: 0.247012 hartree
zpe.thermalcorrgfe: 0.184876 hartree
zpe.sumelectzpe: -690.218710 hartree
zpe.sumelectthermal: -690.202695 hartree
zpe.sumelectthermalent: -690.201751 hartree
zpe.sumelectthermalfe: -690.263887 hartree
dipole: -2.5866 1.1456 1.2484
dipole: 3.0921
quadrupole: -83.0110 -84.1087 -91.8298
quadrupole: 9.2236 -3.0726 -0.0250
quadrupole: 3.3055 2.2078 -5.5133 9.2236 -3.0726 -0.0250
hfenergy: -690.448763 hartree
pointgroup: C01 [X(C12H14O3)]
dipole: -1.022375 -0.4538573 -0.4782679 debye
polarizability: 220.3160319|-5.8528595|146.8841522|-4.5040032|-5.4148055|73.402232 unknown
InChI: InChI=1S/C12H14O3/c1-4-5-15-11-8(2)6-10(12(13)14)7-9(11)3/h4,6-7,13H,1,5H2,2-3H3
charge 0 multiplicity 1
29 atoms
O  -2.052418 -0.195624 0.544355
O  4.237093 -1.106512 -0.280323
O  4.242887 1.213755 -0.324854
C  -0.656364 -0.099413 0.305062
C  0.08466 -1.314897 0.246933
C  -0.034641 1.178935 0.218046
C  2.12519 0.025491 -0.038169
C  1.482139 -1.233686 0.070964
C  1.365563 1.2186 0.044464
C  -0.621356 -2.648653 0.390515
C  -0.845641 2.455216 0.339926
C  -2.918963 0.017206 -0.652716
C  3.592235 0.143675 -0.223209
C  -4.325633 -0.347421 -0.262201
C  -5.4024 0.447326 -0.476694
H  2.084156 -2.145467 0.018455
H  1.890206 2.178312 -0.020461
H  -1.151391 -2.712086 1.357646
H  -1.385998 -2.791723 -0.395484
H  0.097077 -3.483029 0.326802
H  -1.205578 2.805677 -0.647272
H  -1.728941 2.298164 0.982365
H  -0.235067 3.267153 0.769994
H  -2.856444 1.069705 -0.991311
H  -2.549022 -0.639152 -1.469174
H  -4.443785 -1.333912 0.206281
H  5.211519 -0.95017 -0.403616
H  -6.414221 0.124455 -0.209043
H  -5.304963 1.442576 -0.92828
