program: Gaussian 09
title: 000260000
version: EM64L-G09RevD.01
frameworkgroup: C1[X(C19H14N2O)]
method: RPBEPBE
basis: SDD
operation: Freq
keyword: #p
keyword: freq=noraman
keyword: PBEPBE/SDD
title: #p freq=noraman PBEPBE/SDD
converged: YES YES NO NO
title: Mulliken charges:
elementType: O N N C C C C C C C C C C C C C C C C C C C H H H H H H H H H H H H H H
charge: -0.269329 -0.125911 -0.130286 0.376376 0.383643 0.329043 -0.551604 -0.409016 -0.389867 0.090658 0.310099 -0.412646 -0.408767 0.106057 0.436030 -0.240897 -0.364816 -0.351293 -0.236908 -0.376256 -0.380726 -0.805129 0.280816 0.239893 0.256303 0.246268 0.241015 0.252978 0.272793 0.232088 0.230952 0.234426 0.236369 0.228013 0.229157 0.240472
chargesum: 0.00000
title: Mulliken charges with hydrogens summed into heavy atoms:
elementType: O N N C C C C C C C C C C C C C C C C C C C
charge: -0.269329 -0.125911 -0.130286 0.376376 0.383643 0.329043 -0.270788 -0.169123 -0.133564 0.090658 0.310099 -0.166378 -0.167751 0.106057 0.436030 -0.008809 -0.111838 -0.078500 -0.005957 -0.141830 -0.144358 -0.107486
polarizability: 5.06017307e+02 -7.38038041e+00 2.16347239e+02 -7.82772366e-01 1.48326134e-01 8.89968450e+01
1716.lowfreq: -27.6861 -7.7348 -4.7761 -0.0007 -0.0006 0.0005 3.2054 23.2053 35.2263
frequency: -27.6552 23.1668 35.1503 42.6853 72.6886 81.4111 123.7007 149.5005 184.2845 192.2946 212.6477 297.8568 306.8732 333.8995 352.4705 360.8349 403.0797 405.1309 430.1398 479.5106 503.2510 509.4385 515.9981 518.5641 580.1879 613.7746 633.6974 638.5223 639.8133 667.5985 700.1414 728.7902 757.0562 763.0209 790.2239 790.5549 831.2429 835.6184 838.8577 856.1087 882.9144 883.5788 896.2143 931.7790 939.0415 953.8802 968.9555 972.2781 983.4709 986.8321 990.3121 993.1710 996.3489 1016.4295 1023.1923 1046.9507 1064.0322 1125.2394 1130.9777 1159.6527 1174.4155 1183.7216 1195.9987 1225.0380 1229.0708 1246.7928 1267.3424 1277.2755 1312.8765 1358.4405 1370.3555 1397.0390 1410.1575 1416.6484 1423.6148 1436.2182 1440.3075 1455.3245 1470.1277 1472.5918 1497.6053 1533.3161 1544.8716 1576.5294 1578.1399 1608.8805 1626.0886 1638.2774 2976.3292 3058.3476 3088.9893 3123.8144 3128.7047 3130.1299 3131.0005 3131.9383 3145.9453 3147.4816 3160.6790 3164.7961 3165.0188 3168.1322
redmass: 1.0153 5.0481 3.8891 5.3066 5.1148 6.6988 5.6005 6.1167 3.6805 6.0680 5.3492 4.6594 5.0949 3.5153 7.2439 5.1693 3.1185 3.0419 4.6873 2.5129 2.9096 7.1625 6.5247 3.8151 6.4962 5.8751 6.9466 6.8577 4.4430 5.7539 4.2482 3.0069 4.8609 1.3738 4.9291 2.7181 6.5004 1.4140 1.3944 1.2567 1.5697 13.5814 13.2411 5.6839 1.5368 9.6629 1.4134 1.3470 1.9336 1.3806 1.4067 2.7496 1.3596 2.8528 2.3091 1.5844 3.3613 1.3360 1.7025 1.3819 1.0868 2.0893 1.2325 3.0274 2.2805 1.7835 3.1545 1.7749 1.3149 1.8305 4.9996 1.2227 5.7158 3.4977 2.6673 4.9285 2.9566 2.8272 1.1643 1.0593 3.9336 5.0235 5.2640 6.5785 7.0299 5.7311 6.2865 6.7170 1.0391 1.0943 1.1000 1.0861 1.0891 1.0891 1.0894 1.0888 1.0948 1.0929 1.0951 1.1004 1.0967 1.0959
irintensity: 0.5788 0.6502 0.1277 0.6877 0.2398 1.0472 0.2230 1.4307 0.8488 0.0947 0.0254 0.2359 2.2667 0.4370 0.4301 0.9811 0.0248 0.0299 4.3336 28.0641 12.6057 2.4284 6.8304 0.9722 1.3824 10.1924 0.1584 0.3618 0.0331 3.7806 8.1700 6.1684 0.3725 65.4678 1.1290 0.1512 7.0881 0.8870 87.4012 1.8550 24.6243 6.4197 34.2724 14.0381 11.5189 5.6937 8.4686 6.8211 1.2586 2.5128 1.3665 6.4017 0.0133 3.1989 3.3962 26.2572 2.8775 7.3762 9.5971 6.6172 0.0444 4.6860 15.3000 0.1155 22.1585 6.6927 3.6181 8.7813 1.4723 7.8713 1.0029 11.5346 14.7526 19.9412 11.4746 50.7808 19.3158 135.1431 24.1656 13.6906 56.1892 17.3694 3.3086 0.1566 0.9021 4.0811 44.8160 3.2768 36.8452 22.4723 16.1647 2.3128 13.8857 0.7962 27.8900 7.5515 22.7843 6.4546 8.9956 46.5314 0.6970 5.9311
temp: 298.150 k
press: 1.00000 atm
elementType: 8 7 7 6 6 6 6 6 6 6 6 6 6 6 6 6 6 6 6 6 6 6 1 1 1 1 1 1 1 1 1 1 1 1 1 1
symmnumber: 1
zpe: 725136.8 jmol-1
zpe.correction: 0.276190 hartree
zpe.thermalcorrener: 0.292853 hartree
zpe.thermalcorrenthalpy: 0.293797 hartree
zpe.thermalcorrgfe: 0.230026 hartree
zpe.sumelectzpe: -915.650912 hartree
zpe.sumelectthermal: -915.634250 hartree
zpe.sumelectthermalent: -915.633305 hartree
zpe.sumelectthermalfe: -915.697076 hartree
dipole: -0.4447 3.8150 0.0594
dipole: 3.8413
quadrupole: -82.5581 -123.2887 -134.2539
quadrupole: -4.0123 -0.4731 0.0749
quadrupole: 30.8088 -9.9218 -20.8870 -4.0123 -0.4731 0.0749
hfenergy: -915.9271022 hartree
pointgroup: C01 [X(C19H14N2O1)]
dipole: 0.1577645 1.5028505 -0.0219752 debye
polarizability: 505.8111092|10.6952317|216.5543604|-0.5328404|-0.0415444|88.9959208 unknown
InChI: InChI=1S/C19H14N2O/c1-13-6-8-15(9-7-13)18-20-21-19(22-18)17-11-10-14-4-2-3-5-16(14)12-17/h2-12H,1H3
charge 0 multiplicity 1
36 atoms
O  0.92916 0.188344 0.000786
N  0.160322 -1.961213 -0.002954
N  1.59239 -1.996306 -0.002482
C  -3.98233 -0.406986 -0.00258
C  -4.165233 1.032553 -0.000357
C  -1.539796 -0.092451 -0.00145
C  -2.65892 -0.942406 -0.003067
C  -3.003861 1.875653 0.001183
C  -1.721472 1.33451 0.000661
C  -0.202638 -0.670321 -0.001563
C  3.382644 -0.216976 0.004565
C  -5.140588 -1.255534 -0.004079
C  -5.49537 1.564549 0.000292
C  2.018062 -0.724156 0.001648
C  6.078291 0.727445 0.014283
C  -6.424612 -0.707549 -0.003389
C  3.65503 1.177222 0.008828
C  4.466811 -1.137446 0.007509
C  -6.60379 0.713514 -0.001181
C  4.986683 1.635443 0.015124
C  5.791157 -0.664686 0.013969
C  7.509996 1.229025 -0.010224
H  -2.505592 -2.027271 -0.004587
H  -3.139213 2.963462 0.002832
H  -0.840613 1.983317 0.001908
H  -5.000644 -2.342817 -0.005721
H  -5.632354 2.652434 0.001995
H  2.824463 1.890191 0.011161
H  4.250774 -2.210579 0.008696
H  -7.302372 -1.362691 -0.004508
H  -7.617053 1.129819 -0.000642
H  5.184796 2.713798 0.021914
H  6.618764 -1.383742 0.019964
H  7.606012 2.207484 0.491974
H  8.196982 0.519891 0.483592
H  7.864916 1.358077 -1.051495
