program: Gaussian 09
title: 000259947
version: EM64L-G09RevD.01
frameworkgroup: C1[X(C17H12)]
method: RPBEPBE
basis: SDD
operation: Freq
keyword: #p
keyword: freq=noraman
keyword: PBEPBE/SDD
title: #p freq=noraman PBEPBE/SDD
converged: NO YES NO YES
title: Mulliken charges:
elementType: C C C C C C C C C C C C C C C C C H H H H H H H H H H H H
charge: 0.152490 0.396780 0.354166 0.159435 0.369401 -0.554988 0.369886 -0.674754 -0.694064 -0.590601 -0.415787 -0.395240 -0.443345 -0.180577 -0.233156 -0.245171 -0.234142 0.240479 0.254026 0.260214 0.239421 0.239412 0.247988 0.235074 0.243923 0.223798 0.234682 0.220767 0.219883
chargesum: 0.00000
title: Mulliken charges with hydrogens summed into heavy atoms:
elementType: C C C C C C C C C C C C C C C C C
charge: 0.152490 0.396780 0.354166 0.159435 0.369401 -0.314509 0.369886 -0.420728 -0.433850 -0.111768 -0.167799 -0.160166 -0.199423 0.043221 0.001526 -0.024404 -0.014258
polarizability: 5.22738689e+02 1.33735366e+01 1.95423719e+02 1.12012144e-02 8.01102537e-03 7.24658550e+01
1716.lowfreq: -0.0008 -0.0001 0.0007 4.5410 5.1216 5.9499 50.1673 86.2453 118.0630
frequency: 50.0649 86.2337 118.0620 149.7846 198.3275 226.5895 304.3431 313.6843 344.3047 351.4963 416.6042 450.7910 474.4003 486.5426 528.0188 535.7101 544.0945 579.4972 604.2070 657.6146 696.2985 707.3711 724.2495 726.9372 741.2640 763.9555 777.9825 793.3700 847.7594 858.7658 866.2182 877.7438 900.7682 931.5413 942.3688 949.5227 951.2184 954.9579 976.7598 985.9399 988.8626 1053.1197 1108.7465 1138.2891 1160.1187 1165.6125 1174.5011 1176.7625 1196.1265 1207.6475 1233.0162 1265.5659 1303.5895 1325.5065 1339.4856 1361.5629 1372.5923 1390.9310 1419.8414 1422.4539 1445.2055 1488.7019 1498.0041 1521.6289 1537.9968 1566.4338 1591.9223 1611.8229 1630.1931 2912.7840 2932.6575 3101.5334 3115.5329 3117.3038 3119.3863 3122.7675 3126.3740 3139.1430 3154.5055 3156.4975 3187.5417
redmass: 3.5725 3.3143 3.7113 4.8784 3.6632 3.4436 5.2004 3.5750 5.6167 4.4157 2.6206 2.6836 5.1433 2.5269 5.5790 6.4272 3.1628 6.0329 6.7064 2.6990 5.7645 1.3022 1.5885 4.9786 1.7035 5.1463 2.9695 1.7267 4.0171 1.6837 1.6236 5.6029 1.4705 1.6724 2.3844 1.6705 1.3969 4.8409 1.3245 1.3774 2.2537 2.4023 2.0474 1.4153 1.2224 1.6489 1.0958 1.1903 2.1877 2.0131 1.4948 1.9472 2.1277 1.9179 2.0841 4.1670 2.5180 1.6990 2.1014 1.1725 4.5323 4.7978 5.3539 5.5351 6.2653 6.5546 5.4577 6.4130 7.2231 1.0599 1.0958 1.0910 1.0847 1.0859 1.0911 1.0879 1.0909 1.0958 1.0994 1.1000 1.0960
irintensity: 0.1867 2.7877 1.6957 1.8866 1.6358 0.0316 0.7483 0.3555 0.3666 1.1777 22.1438 7.8267 1.9560 1.8361 13.8081 24.4962 0.0079 35.6096 5.2748 13.3166 0.6637 25.3049 9.5359 1.2164 66.5934 22.7166 0.3926 63.7780 0.4063 0.7227 1.2363 3.3501 18.2239 37.9348 65.4704 2.6298 2.2254 6.8256 0.0431 0.6287 5.0520 4.0823 21.6168 73.1154 0.2870 0.1460 1.5473 23.7746 32.8235 3.6868 1.0867 2.0333 1.2870 28.6659 27.8232 39.1989 7.3826 21.1874 0.9617 40.2522 12.0507 74.4432 72.5134 8.3961 5.4474 59.8382 122.2075 3.9353 13.0103 32.3753 13.0261 15.9366 4.0873 3.4410 5.4661 0.0655 29.5372 43.4886 69.8739 72.3429 4.0188
temp: 298.150 k
press: 1.00000 atm
elementType: 6 6 6 6 6 6 6 6 6 6 6 6 6 6 6 6 6 1 1 1 1 1 1 1 1 1 1 1 1
symmnumber: 1
zpe: 599793.4 jmol-1
zpe.correction: 0.228449 hartree
zpe.thermalcorrener: 0.240690 hartree
zpe.thermalcorrenthalpy: 0.241634 hartree
zpe.thermalcorrgfe: 0.189949 hartree
zpe.sumelectzpe: -653.837263 hartree
zpe.sumelectthermal: -653.825022 hartree
zpe.sumelectthermalent: -653.824078 hartree
zpe.sumelectthermalfe: -653.875764 hartree
dipole: -3.7814 -0.5414 0.0002
dipole: 3.8200
quadrupole: -78.6015 -83.7599 -106.3820
quadrupole: 0.8898 0.0005 0.0006
quadrupole: 10.9796 5.8212 -16.8008 0.8898 0.0005 0.0006
hfenergy: -654.0657125 hartree
pointgroup: C01 [X(C17H12)]
dipole: -1.4885907 0.2068611 -0.0000671 debye
polarizability: 522.8432173|-12.0260956|195.3191913|-0.0112341|0.0079649|72.465855 unknown
InChI: InChI=1S/C17H12/c1-2-6-13-11-17-15(9-12(13)5-1)10-14-7-3-4-8-16(14)17/h1-5,7-11H,6H2
charge 0 multiplicity 1
29 atoms
C  0.44563 0.29006 -0.000145
C  0.211465 -1.1669 -0.000313
C  -1.973697 0.717578 -0.000186
C  1.858138 0.480389 -0.000083
C  -2.210053 -0.724204 -0.000226
C  -0.65699 1.18843 -0.000089
C  2.499639 -0.858816 -0.000222
C  -1.090466 -1.650561 -0.000355
C  1.50163 -1.851846 -0.00037
C  -3.164823 1.673595 -0.000416
C  -3.522193 -1.232264 0.000033
C  2.670297 1.655116 0.000076
C  3.93743 -0.949661 -0.000188
C  -4.519019 1.007077 0.000406
C  -4.673381 -0.362079 0.000493
C  4.061893 1.523956 0.000105
C  4.692853 0.220195 -0.000024
H  -0.473068 2.27156 0.00002
H  -1.300894 -2.727757 -0.000421
H  1.650892 -2.933008 -0.000488
H  -3.115466 2.358596 -0.877497
H  -3.114823 2.359922 0.875552
H  -3.67512 -2.318976 -0.000001
H  2.208892 2.649844 0.00018
H  4.424838 -1.93149 -0.000294
H  -5.401995 1.659728 0.000775
H  -5.676247 -0.803166 0.000946
H  4.697462 2.417178 0.000225
H  5.787977 0.167406 0.000009
