program: Gaussian 09
title: 000260041
version: EM64L-G09RevD.01
frameworkgroup: C1[X(C24H21BrN4O)]
method: RPBEPBE
basis: SDD
operation: Freq
keyword: #p
keyword: freq=noraman
keyword: PBEPBE/SDD
title: #p freq=noraman PBEPBE/SDD
converged: YES YES NO NO
title: Mulliken charges:
elementType: Br O N N N N C C C C C C C C C C C C C C C C C C C C C C C C H H H H H H H H H H H H H H H H H H H H H
charge: 0.013288 -0.226759 -0.349626 -0.042972 -0.148757 -0.087121 0.168284 0.462959 0.107028 0.118214 0.047794 -0.335772 -0.335120 -0.257029 -0.767081 -0.340921 0.251939 -0.373360 -0.351261 -0.243999 -0.156509 0.410674 0.466116 -0.360539 -0.336121 -0.395862 -0.402463 -0.401031 -0.645550 -0.646281 0.248969 0.246271 0.289145 0.253140 0.250516 0.264719 0.266163 0.254539 0.245375 0.254586 0.238803 0.239628 0.222913 0.271692 0.215331 0.220133 0.238450 0.238276 0.239454 0.240310 0.219426
chargesum: 0.00000
title: Mulliken charges with hydrogens summed into heavy atoms:
elementType: Br O N N N N C C C C C C C C C C C C C C C C C C C C C C C C
charge: 0.013288 -0.226759 -0.349626 -0.042972 -0.148757 -0.087121 0.168284 0.462959 0.107028 0.118214 0.047794 -0.086802 -0.088849 0.032115 0.001294 -0.074758 0.251939 -0.118821 -0.105886 -0.243999 0.098077 0.410674 0.466116 -0.121736 -0.096493 -0.172949 -0.130771 -0.185700 0.051308 0.052909
polarizability: 7.50783706e+02 1.83195944e+01 2.55656038e+02 9.91365755e+00 -1.45923949e+01 1.95872682e+02
1716.lowfreq: -0.0012 0.0001 0.0012 1.1175 1.3736 6.2816 12.7624 14.6049 20.5945
frequency: 12.7011 14.4622 20.4503 36.8293 41.3976 49.9988 63.0217 75.6535 84.9440 96.6652 121.7702 135.6720 141.9357 150.0555 154.5284 162.8149 183.0337 193.9333 202.5708 228.0060 232.6926 254.4271 261.3765 302.4296 319.0105 353.1230 353.5183 359.8249 396.4012 409.3934 413.2327 415.2697 428.8540 446.6416 466.7459 489.9716 493.5672 509.5036 525.6438 540.5174 546.4118 553.1482 565.6250 621.8678 624.4514 631.7586 642.7628 659.7821 671.5517 696.6843 721.6508 732.2402 743.0046 788.1736 807.0309 813.2266 820.2064 830.1703 835.5973 841.8489 843.6543 856.9825 876.5124 930.0448 940.4192 941.7060 946.3709 968.1104 975.1258 977.4190 988.2462 989.8998 994.6687 1000.8262 1020.1502 1047.4563 1054.1038 1057.0091 1081.2830 1105.2630 1106.3465 1111.2093 1118.4151 1127.6020 1161.8778 1166.2039 1182.7484 1195.5240 1201.5493 1226.8668 1241.5614 1256.8843 1264.8639 1273.0983 1290.3333 1309.3412 1317.7986 1348.5697 1362.9885 1370.9477 1384.4230 1394.7594 1395.8867 1408.7944 1414.9905 1430.6736 1447.1101 1450.4184 1451.3033 1458.9692 1461.7276 1464.9222 1477.3700 1488.4838 1492.0597 1505.9821 1533.5602 1548.3450 1549.0295 1559.2597 1566.6716 1585.4097 1601.2885 1618.0873 1621.3532 1635.0362 2932.1653 2947.1216 2954.5629 2998.7540 3015.4561 3019.7786 3077.6668 3100.7782 3110.7801 3115.1167 3133.5717 3135.2922 3141.1147 3147.0223 3155.0470 3158.7089 3166.5914 3168.8871 3170.0178 3170.5230 3178.7966
redmass: 6.5781 3.9323 6.5799 6.1977 3.6207 6.0562 4.8500 2.3563 5.5957 5.9085 1.8463 3.5761 7.2710 5.1955 1.4769 2.8449 2.7832 2.6206 1.2680 4.4644 8.8618 2.6029 4.2528 4.1268 5.7154 5.1447 4.0387 4.2942 5.2724 4.9742 4.2155 2.9534 3.1176 4.0451 3.8120 5.2645 4.3766 4.6922 2.7358 3.0572 4.1206 5.8097 4.9198 4.9266 4.3718 6.8232 6.0381 6.5094 6.9136 6.1295 4.8285 3.8835 3.5183 3.8115 1.3357 3.2980 2.0413 1.5424 1.7066 1.6166 4.6384 5.0333 3.9455 1.4385 2.8292 1.4062 1.4127 1.3631 1.3520 1.5023 1.9840 2.1659 2.8825 2.7867 2.5818 1.5491 2.2357 1.5087 3.1650 1.2372 1.3072 1.3277 1.6773 1.4953 1.6759 1.5390 1.3946 2.6860 1.5404 1.9392 4.0384 2.8986 1.7330 2.0519 1.2883 4.6451 1.6311 3.2787 2.5743 4.2898 10.0801 2.1557 1.5864 3.2902 3.9735 1.2387 1.6594 2.2781 1.7215 1.2964 1.0498 1.0402 1.0456 2.4794 1.1277 1.1536 2.8304 8.2409 7.0381 6.8610 7.4441 5.9671 7.8067 9.0183 7.5883 6.4092 1.0857 1.0368 1.0391 1.0381 1.1002 1.1024 1.0968 1.0966 1.0946 1.0895 1.0876 1.0993 1.0893 1.0875 1.0970 1.0885 1.0933 1.0966 1.0928 1.0952 1.0978
irintensity: 0.6303 0.0632 1.4706 0.2784 0.0695 0.5428 0.6340 0.2589 1.5356 0.8881 3.2033 0.8744 1.0269 0.8251 1.8019 2.0060 1.7783 2.6819 0.2606 7.0260 4.7636 0.3938 0.8152 2.4771 5.4945 7.5977 8.4419 2.5135 0.4706 3.8350 1.3493 1.2775 1.7075 1.6925 3.1775 11.9326 8.4119 10.4813 6.6824 20.4690 16.3976 8.4296 11.4161 1.1987 45.5188 3.4684 0.7759 13.0745 14.1657 1.1851 16.7927 3.6580 3.3539 0.6876 13.4338 4.1071 8.9107 34.0622 43.4429 48.1427 13.1442 32.0019 30.9809 8.9386 40.1865 3.3351 0.7550 0.8748 1.4231 22.4439 4.6542 13.0742 0.1072 24.8148 1.7993 3.4932 13.4075 25.6831 9.1963 0.0141 13.9499 1.0204 20.2488 29.0049 196.2915 25.9399 164.1195 35.2916 15.3221 24.1606 38.0064 25.3287 11.2081 36.0038 0.5194 182.2467 49.9199 0.1433 131.8768 244.9011 53.5100 14.2700 16.9897 13.9522 6.1767 17.6060 40.9187 192.5909 88.6259 9.4491 23.5686 0.2203 23.3821 210.0752 21.8449 34.1963 537.5420 5.9458 202.1512 233.3528 4.0489 858.4855 61.4461 106.3127 215.2308 279.0878 51.5430 99.1558 172.6773 15.4618 16.5046 61.9977 7.6545 4.1323 51.0940 9.8966 16.4566 15.6567 15.2021 2.9490 9.3629 1.2176 21.8768 4.0961 3.4343 20.2988 8.7704
temp: 298.150 k
press: 1.00000 atm
elementType: 35 8 7 7 7 7 6 6 6 6 6 6 6 6 6 6 6 6 6 6 6 6 6 6 6 6 6 6 6 6 1 1 1 1 1 1 1 1 1 1 1 1 1 1 1 1 1 1 1 1 1
symmnumber: 1
zpe: 1031560.4 jmol-1
zpe.correction: 0.392901 hartree
zpe.thermalcorrener: 0.420270 hartree
zpe.thermalcorrenthalpy: 0.421214 hartree
zpe.thermalcorrgfe: 0.330901 hartree
zpe.sumelectzpe: -1232.764088 hartree
zpe.sumelectthermal: -1232.736719 hartree
zpe.sumelectthermalent: -1232.735775 hartree
zpe.sumelectthermalfe: -1232.826087 hartree
dipole: -9.9672 2.7466 -0.9340
dipole: 10.3808
quadrupole: -97.5593 -186.5715 -176.6156
quadrupole: 18.1896 5.9922 -4.6418
quadrupole: 56.0229 -32.9894 -23.0335 18.1896 5.9922 -4.6418
hfenergy: -1233.1569888 hartree
pointgroup: C01 [X(C24H21Br1N4O1)]
dipole: 3.8336695 -1.4031863 0.1182746 debye
polarizability: 750.7192962|-18.3889747|259.1029835|10.7867531|-3.213346|192.4901452 unknown
InChI: InChI=1S/C24H21BrN4O/c1-16-27-23-13-6-18(25)14-22(23)24(30)29(16)21-11-7-19(8-12-21)26-15-17-4-9-20(10-5-17)28(2)3/h4-15H,1-3H3
charge 0 multiplicity 1
51 atoms
Br -8.780125 2.664532 -1.353551
O  -3.293023 1.733398 -0.634825
N  -3.10107 -0.490193 0.120541
N  -5.019952 -1.920763 0.424916
N  9.077114 0.410054 -0.075717
N  2.55561 0.179112 0.50044
C  -5.319872 0.41768 -0.356504
C  -1.6530 -0.33163 0.200437
C  -3.708969 -1.720355 0.464812
C  -3.862386 0.651629 -0.320245
C  -5.845475 -0.858104 0.019767
C  -1.052793 0.032799 1.427364
C  -0.861464 -0.509279 -0.954624
C  -6.18405 1.466946 -0.76479
C  -2.811867 -2.856717 0.891255
C  -7.253627 -1.06152 -0.020216
C  1.163781 -0.025416 0.360712
C  0.342219 0.193416 1.503669
C  0.536616 -0.361294 -0.877921
C  -7.563152 1.230622 -0.792038
C  -8.112264 -0.026756 -0.422645
C  7.703619 0.175202 -0.091844
C  4.863672 -0.298253 -0.126169
C  7.145681 -0.925305 -0.8237
C  6.796008 1.030026 0.625096
C  5.76111 -1.146935 -0.833725
C  5.417837 0.794283 0.604089
C  3.426786 -0.551547 -0.163957
C  9.98659 -0.479179 -0.812281
C  9.625455 1.546893 0.678902
H  -1.680973 0.208457 2.307389
H  -1.344257 -0.741403 -1.910017
H  -5.745133 2.428862 -1.045098
H  -2.253744 -2.612137 1.812421
H  -2.060715 -3.092553 0.116621
H  -3.444451 -3.737075 1.072446
H  -7.644303 -2.041135 0.26957
H  0.826063 0.490396 2.439003
H  1.144315 -0.462625 -1.784014
H  -9.19425 -0.183769 -0.453005
H  7.795826 -1.603403 -1.382848
H  7.178741 1.879262 1.197877
H  5.360382 -1.996325 -1.402478
H  4.730248 1.44799 1.15105
H  3.10754 -1.424466 -0.775348
H  11.023106 -0.130847 -0.684411
H  9.761168 -0.487689 -1.897632
H  9.929219 -1.522575 -0.441988
H  9.39849 1.469597 1.76106
H  9.225081 2.513277 0.31271
H  10.720136 1.568614 0.563247
