program: Gaussian 09
title: 000259937
version: EM64L-G09RevD.01
frameworkgroup: C1[X(C13H8BrF)]
method: RPBEPBE
basis: SDD
operation: Freq
keyword: #p
keyword: freq=noraman
keyword: PBEPBE/SDD
title: #p freq=noraman PBEPBE/SDD
converged: NO YES NO NO
title: Mulliken charges:
elementType: Br F C C C C C C C C C C C C C H H H H H H H H
charge: -0.022551 -0.203841 -0.814855 0.382737 0.354937 0.001153 0.220338 -0.404210 -0.381790 0.217461 -0.395492 -0.195606 -0.371321 -0.234985 -0.219491 0.323362 0.258819 0.254901 0.272240 0.236537 0.257170 0.232255 0.232232
chargesum: 0.00000
title: Mulliken charges with hydrogens summed into heavy atoms:
elementType: Br F C C C C C C C C C C C C C
charge: -0.022551 -0.203841 -0.491493 0.382737 0.354937 0.001153 0.220338 -0.145390 -0.126888 0.217461 -0.123252 0.040931 -0.114151 -0.002730 0.012741
polarizability: 1.95407923e+02 1.78833228e+01 2.06834152e+02 5.86195766e+00 -6.94192499e+00 7.55436670e+01
1716.lowfreq: -6.9585 -4.7774 0.0005 0.0007 0.0009 3.7857 51.1812 90.9727 98.8015
frequency: 51.1757 90.9675 98.7990 130.0590 167.9735 223.2928 228.4190 306.1416 346.5439 398.7200 427.0742 439.4714 514.6801 529.0262 548.3280 558.7483 578.0272 632.8222 646.6143 684.8602 732.7672 766.4207 774.2751 780.2148 802.7796 840.6628 889.9122 900.7231 959.0494 969.1743 974.5406 994.0872 995.5482 1026.1297 1062.3894 1101.0121 1121.5549 1162.5760 1171.9171 1174.9447 1195.1144 1207.4166 1236.0586 1264.1295 1302.8337 1377.4583 1398.5066 1435.4628 1450.3913 1466.6270 1487.0475 1588.2604 1594.3691 1618.4505 1631.9117 3080.3936 3133.0703 3144.2659 3146.4104 3161.0410 3163.1195 3174.3862 3181.0394
redmass: 8.9314 7.2592 5.9766 5.3499 7.0246 10.3851 4.5739 4.9589 6.4647 6.8569 3.8812 3.8555 6.3010 4.6548 6.9395 3.4292 5.2701 6.7809 4.6249 6.4545 2.0913 2.6469 1.6144 3.7197 2.3044 4.5615 1.4333 1.3973 1.4109 1.6426 3.1472 1.6840 3.3260 2.1973 1.7860 1.8776 1.1396 1.2893 1.1569 1.1127 2.5509 2.7695 2.5701 2.6819 1.5817 8.3072 3.1332 2.4356 3.0631 3.0142 4.5691 7.2777 6.6504 7.3322 9.3415 1.0875 1.0859 1.0911 1.0874 1.0959 1.0934 1.0988 1.0982
irintensity: 1.0438 0.8123 3.3918 0.2286 1.9607 2.7662 0.3953 0.2765 1.8585 1.0048 6.0030 13.1492 5.5605 2.8209 1.7261 1.4799 5.2885 15.5853 29.1280 21.3284 107.7298 1.1274 9.5145 19.7726 46.6174 14.9723 0.5036 0.2977 2.4208 2.3244 13.7119 0.7022 1.3426 1.7220 5.2580 4.1613 30.6568 5.1003 0.1162 0.2226 44.0815 17.4577 10.0063 5.8745 1.7246 2.5325 0.7470 26.5905 42.3528 9.6893 3.2627 20.5416 0.9321 7.2359 1.5113 2.4879 0.1469 11.0557 1.9028 20.7797 8.1731 15.7418 8.3937
temp: 298.150 k
press: 1.00000 atm
elementType: 35 9 6 6 6 6 6 6 6 6 6 6 6 6 6 1 1 1 1 1 1 1 1
symmnumber: 1
zpe: 438073.6 jmol-1
zpe.correction: 0.166853 hartree
zpe.thermalcorrener: 0.178453 hartree
zpe.thermalcorrenthalpy: 0.179397 hartree
zpe.thermalcorrgfe: 0.127793 hartree
zpe.sumelectzpe: -612.486429 hartree
zpe.sumelectthermal: -612.474829 hartree
zpe.sumelectthermalent: -612.473885 hartree
zpe.sumelectthermalfe: -612.525489 hartree
dipole: -0.4743 0.1239 1.6372
dipole: 1.7090
quadrupole: -92.1737 -83.2862 -97.3563
quadrupole: 10.4303 2.6644 -2.9252
quadrupole: -1.2350 7.6525 -6.4176 10.4303 2.6644 -2.9252
hfenergy: -612.6532825 hartree
pointgroup: C01 [X(C13H8Br1F1)]
dipole: 0.0859444 -0.0737252 0.6627786 debye
dipolederiv: -0.2081641 0.0376442 -0.0186438 0.0331552 -0.6471573 0.2123861 -0.0320084 0.4268729 -0.3314891 -0.2059409 -0.1308645 -0.0185713 0.0847944 -0.9819465 -0.1102942 0.018547 -0.1392888 -0.1550044 0.3873772 -0.0052701 0.0259329 -0.0123961 0.8080997 -0.3533718 0.0457639 -0.5633843 0.5103833 -0.1411449 -0.0743089 0.0455772 -0.0589449 0.0073274 0.0279311 0.0124086 0.0515888 -0.1189223 -0.2371971 0.0278336 -0.0360852 0.0405547 -0.0713317 0.0212941 -0.018865 0.0351139 -0.1285627 0.1848287 -0.0141458 0.0189702 0.0210998 -0.2069705 -0.0247036 -0.0322314 0.0014358 -0.0060672 0.2052697 0.1246193 0.0002352 0.0192976 0.0128991 -0.0117752 0.0340345 0.0457096 0.0325346 -0.0906651 0.0756457 -0.0161055 0.1237233 0.0693962 0.0485777 0.0280369 -0.0117334 -0.1225641 0.0433069 -0.0618113 -0.0037305 -0.1368135 0.0739652 0.0512578 -0.02401 -0.0126312 -0.1088538 0.1233981 0.2206526 -0.0125788 -0.091034 1.0766802 0.1401061 -0.0109118 0.1513885 0.1088898 -0.1301602 -0.1843912 0.0143656 -0.051247 0.0050913 0.0428112 -0.0110679 0.0138643 -0.1323705 0.0269935 -0.0038639 0.0108163 -0.024973 0.0674189 0.0207128 -0.0083444 0.030153 -0.1524836 -0.035553 -0.1856035 -0.012723 -0.0351823 -0.1808774 0.0252998 -0.0087934 -0.0009683 -0.1422233 0.0301714 0.0017179 -0.0111654 -0.0643843 -0.0565288 0.010155 -0.013268 0.0034122 -0.1558198 0.0128389 0.1358034 -0.0041733 0.1498884 0.0367377 0.0489372 0.0260721 0.0335903 -0.1369998 0.0115955 0.0064851 -0.0031841 0.0037922 -0.0527604 0.0153178 -0.0067607 0.0552452 -0.0513626 0.0885354 -0.009959 0.0025 -0.0507834 -0.0553738 -0.0335137 -0.0101524 -0.0091697 0.1474823 0.0654438 0.0384336 0.0039745 0.0828047 -0.0479009 -0.0342083 0.0134161 -0.006441 0.1389886 0.0800384 0.0664331 0.0141096 0.0376998 -0.0089791 -0.0248289 -0.000837 -0.0351943 0.1607338 -0.0965337 -0.0396851 -0.0144315 -0.0501345 0.0766383 -0.0132563 -0.007811 -0.0107901 0.1588856 0.0199804 0.0706808 0.0106678 0.0786845 0.0306287 -0.022214 0.012003 -0.0239752 0.1742744 -0.1296296 0.0019069 0.0150806 0.0157244 0.0884642 -0.0101903 0.0077175 -0.0087088 0.1591237 -0.0047894 -0.0979526 -0.0108374 -0.115326 -0.0435205 -0.0264303 -0.0129383 -0.0260895 0.1514269 unknown
polarizability: 219.3699015|4.5110022|183.165367|1.5816353|-6.8978248|75.250473 unknown
InChI: InChI=1S/C13H8BrF/c14-13-9-5-2-1-4-8(9)12-10(13)6-3-7-11(12)15/h1-7,13H
charge 0 multiplicity 1
23 atoms
Br -0.398196 3.233198 -1.054609
F  1.460089 -2.684503 -0.338705
C  -0.266287 1.753447 0.396835
C  1.018818 0.96401 0.252436
C  -1.35853 0.719744 0.235916
C  0.692113 -0.408594 0.023399
C  -0.774163 -0.565517 0.011976
C  2.35156 1.399032 0.332772
C  -2.752278 0.87607 0.299913
C  1.748834 -1.318563 -0.119632
C  -1.589261 -1.705172 -0.149836
C  3.391094 0.446436 0.181229
C  3.095111 -0.919139 -0.046078
C  -3.572254 -0.268495 0.136655
C  -2.994688 -1.542673 -0.086778
H  -0.332108 2.361421 1.312336
H  2.585149 2.456975 0.487765
H  -3.198629 1.864769 0.451713
H  -1.145198 -2.690551 -0.316892
H  4.437107 0.763987 0.236075
H  3.88803 -1.663113 -0.165042
H  -4.662002 -0.167182 0.179099
H  -3.645514 -2.414787 -0.21325
