program: Gaussian 09
title: 000259930
version: EM64L-G09RevD.01
frameworkgroup: C1[X(C13H9ClFN)]
method: RPBEPBE
basis: SDD
operation: Freq
keyword: #p
keyword: freq=noraman
keyword: PBEPBE/SDD
title: #p freq=noraman PBEPBE/SDD
converged: YES YES NO NO
title: Mulliken charges:
elementType: Cl F N C C C C C C C C C C C C C H H H H H H H H H
charge: -0.078752 -0.211548 -0.693359 -0.692920 0.322486 0.220062 0.300330 0.187651 -0.632449 -0.427763 -0.584567 -0.355699 0.667704 -0.365975 0.344712 -0.388513 0.247578 0.247620 0.237231 0.261017 0.267447 0.242959 0.253135 0.311508 0.320106
chargesum: 0.00000
title: Mulliken charges with hydrogens summed into heavy atoms:
elementType: Cl F N C C C C C C C C C C C C C
charge: -0.078752 -0.211548 -0.061744 -0.197722 0.322486 0.220062 0.300330 0.187651 -0.395217 -0.166746 -0.317120 -0.112740 0.667704 -0.365975 0.344712 -0.135378
polarizability: 2.79068772e+02 9.21908526e+00 1.63063189e+02 7.79225218e-03 -5.87869637e-03 6.32628349e+01
1716.lowfreq: -4.6299 -3.0638 -0.0018 -0.0017 0.0015 4.1817 57.1484 83.9241 126.8726
frequency: 57.1434 83.9237 126.8708 157.5181 193.8834 245.5906 247.7314 290.8343 291.8929 323.7533 363.2327 377.1910 398.9818 421.6590 433.7847 457.6252 461.4649 517.5038 538.1699 549.6244 582.9037 629.2751 668.9166 712.2939 713.7043 730.9116 745.2990 770.0367 817.7603 848.3887 868.8438 878.2649 917.0332 939.7304 956.9894 958.4077 1003.6463 1048.6064 1095.2965 1126.0082 1134.8557 1147.1301 1194.3658 1199.6114 1240.6311 1251.6741 1275.8334 1337.0156 1377.7270 1384.4825 1427.1289 1438.4922 1458.0613 1465.8246 1496.1720 1579.8818 1597.4482 1622.3082 1623.4981 1644.4138 2984.6517 3029.4530 3124.3106 3140.7670 3159.7582 3161.9068 3176.8166 3553.6900 3701.7206
redmass: 8.1711 5.0685 9.7697 6.6113 3.7954 7.4070 2.6925 10.4899 4.3749 5.2350 7.7770 1.4315 2.8903 2.4972 3.0784 4.4667 1.1590 7.8166 3.2457 3.7084 6.1323 4.3327 7.1138 3.7808 6.2359 5.4573 3.0956 5.7765 1.4365 1.5158 1.4611 1.4892 3.7241 1.4061 3.1342 2.1672 5.5511 1.5936 1.7715 1.5249 1.1427 2.2131 2.4609 1.6201 3.0023 1.4053 1.4307 5.3832 7.2615 3.7721 1.1413 4.7181 6.2529 3.3816 4.6604 7.9528 7.6893 7.3216 1.5274 3.1890 1.0607 1.0995 1.0917 1.0900 1.0926 1.0932 1.0957 1.0454 1.1035
irintensity: 0.0682 0.5169 0.2824 5.2676 1.1163 0.6873 4.4651 3.2071 0.1176 3.8626 1.5606 119.0596 39.4819 49.0987 0.1773 4.0419 114.1251 31.5640 0.8940 5.5432 1.3523 6.2076 15.5123 0.0057 5.8676 17.2713 0.0109 2.7286 45.8035 49.8208 9.0617 5.9123 38.6602 2.3195 13.1918 21.4524 20.8936 24.2280 9.6982 27.9676 0.0217 13.7687 22.1223 10.5653 42.9853 22.8121 0.1453 36.6824 35.0384 6.8871 14.0073 32.0478 7.2029 276.4671 13.7165 11.3543 19.6523 0.1987 26.5761 360.0470 15.4402 7.1481 18.2938 8.9743 1.1373 3.7728 6.9647 129.6281 34.4782
temp: 298.150 k
press: 1.00000 atm
elementType: 17 9 7 6 6 6 6 6 6 6 6 6 6 6 6 6 1 1 1 1 1 1 1 1 1
symmnumber: 1
zpe: 481379.2 jmol-1
zpe.correction: 0.183348 hartree
zpe.thermalcorrener: 0.196237 hartree
zpe.thermalcorrenthalpy: 0.197181 hartree
zpe.thermalcorrgfe: 0.144105 hartree
zpe.sumelectzpe: -1114.365178 hartree
zpe.sumelectthermal: -1114.352289 hartree
zpe.sumelectthermalent: -1114.351345 hartree
zpe.sumelectthermalfe: -1114.404421 hartree
dipole: 3.0550 2.7756 -0.0021
dipole: 4.1276
quadrupole: -103.4686 -82.5666 -103.8109
quadrupole: 9.1653 -0.0098 -0.0157
quadrupole: -6.8533 14.0488 -7.1955 9.1653 -0.0098 -0.0157
hfenergy: -1114.5485259 hartree
pointgroup: C01 [X(C13H9Cl1F1N1)]
dipole: -1.2783637 1.0014339 0.0005542 debye
dipolederiv: -0.5912184 -0.3120089 0.0000211 -0.4101681 -0.4331592 0.0000519 -0.0002539 -0.0001333 -0.0744355 -1.4380118 -0.0474893 0.0000472 -0.1325795 -0.2145275 0.0000182 0.000303 0.0000007 -0.1534361 -1.7855065 0.3973803 -0.0000613 0.5192975 -0.2527996 0.0024051 -0.0027217 0.0028227 -0.7061434 0.000719 0.004897 0.0000024 -0.0135459 -0.0790238 0.0000684 0.0001072 -0.0000401 0.1518602 0.2047765 -0.0637241 -0.000003 0.1289438 0.2277203 -0.0000421 -0.0001774 -0.0001571 -0.0298513 -0.2356204 0.0834652 -0.0000787 -0.0991424 -0.2343282 0.0001192 -0.0000654 0.0002794 -0.0321269 -0.1501059 -0.0572001 0.00009 -0.3168164 0.1877485 -0.0001122 0.0002696 -0.0001083 -0.0488828 0.6258812 -0.1611973 0.0000422 0.0473407 -0.1918721 0.0000584 -0.0001591 0.0000123 0.0003892 -0.3900372 0.2073103 0.000041 -0.3421971 0.1012795 -0.0005518 -0.0007955 -0.0000788 -0.233923 0.2675033 0.023714 -0.0000483 -0.1264477 -0.0509833 0.0000336 -0.0002819 -0.0002339 -0.0800933 -0.0676385 0.0367483 -0.0000047 0.1657763 -0.0212577 -0.0000718 0.0000305 -0.0000739 -0.171465 0.0022251 -0.015627 -0.0000146 0.1201662 0.0965393 -0.0000569 0.0000474 -0.000107 -0.1491982 1.4912765 -0.5809307 0.0004787 -0.7981975 0.0355348 -0.0008733 0.0012209 -0.0011195 0.1530912 0.2508332 0.4564795 -0.0000906 1.2980785 0.4571622 0.0001524 0.0018284 0.0003517 -0.128877 1.3110968 0.0487673 -0.0001141 0.3191382 0.2622743 -0.0000468 -0.0005398 0.0000017 0.0719256 -0.2719286 0.0132718 0.000027 -0.3259958 -0.0485614 0.0000136 0.0001354 -0.0000225 -0.1635169 -0.000358 -0.0004508 -0.0074709 -0.0019956 0.0161743 -0.0857129 -0.0158072 -0.1270313 -0.0008613 -0.0004266 -0.0003647 0.0074567 -0.0020219 0.0163952 0.0857056 0.0158209 0.1270391 -0.000955 0.0245466 0.0400112 -0.0000471 0.0655653 -0.1025405 0.0003079 -0.0001068 0.000418 0.1692 0.1077775 0.0449836 0.0000086 0.0230343 -0.0294443 0.0000079 -0.0001447 -0.0000452 0.1571959 0.0645549 -0.0374566 0.0000068 -0.0820416 -0.0207438 0.0000642 0.0000606 0.0000919 0.1772589 0.0603955 -0.0888514 0.0000236 -0.0533996 -0.0554268 0.000052 0.0000199 0.0000828 0.1516153 0.0102111 0.0744513 -0.0000207 0.0901284 0.009885 0.000027 -0.0000193 0.0000249 0.1807297 0.2249671 -0.046705 -0.000333 -0.1030573 0.1394898 -0.0009367 0.0016563 -0.0015527 0.3833524 0.2840876 -0.0194737 0.0000415 0.0301371 0.1844648 -0.0006806 -0.0004276 -0.0004215 0.3771474 unknown
polarizability: 279.7928901|-0.6821969|162.339068|0.014333|-0.0157021|63.2628377 unknown
InChI: InChI=1S/C13H9ClFN/c14-12-6-11-8(5-13(12)16)3-7-4-9(15)1-2-10(7)11/h1-2,4-6H,3,16H2
charge 0 multiplicity 1
25 atoms
Cl -4.201733 -2.062979 0.000212
F  5.142501 0.026482 0.000016
N  -4.548811 0.952131 -0.000658
C  0.452887 1.928214 -0.000652
C  -0.823468 1.092752 -0.000086
C  -0.491575 -0.296889 0.000361
C  1.552214 0.871232 -0.00004
C  0.973456 -0.437628 0.00028
C  -2.15576 1.520723 -0.000482
C  -1.51947 -1.265499 0.000463
C  2.946046 1.044713 0.000039
C  1.79962 -1.584199 0.000483
C  -3.216467 0.560927 0.00031
C  -2.84872 -0.818457 0.000654
C  3.736444 -0.122099 0.000308
C  3.204839 -1.424963 0.000501
H  0.516317 2.586887 0.887469
H  0.516338 2.586264 -0.889271
H  -2.407591 2.588056 -0.001937
H  -1.303661 -2.337926 0.000392
H  3.4210 2.030256 -0.000305
H  1.368726 -2.590903 0.000733
H  3.88117 -2.284515 0.00065
H  -4.800697 1.935386 0.00368
H  -5.284701 0.249835 -0.003221
