program: Gaussian 09
title: 000259932
version: EM64L-G09RevD.01
frameworkgroup: C1[X(C13H8BrNO)]
method: RPBEPBE
basis: SDD
operation: Freq
keyword: #p
keyword: freq=noraman
keyword: PBEPBE/SDD
title: #p freq=noraman PBEPBE/SDD
converged: YES YES YES YES
title: Mulliken charges:
elementType: Br O N C C C C C C C C C C C C C H H H H H H H H
charge: 0.014705 -0.157729 -0.695862 0.269185 0.292345 0.242669 0.230325 -0.313718 -0.374440 -0.628119 -0.341673 -0.410258 0.543745 -0.435615 -0.203733 -0.203027 0.243029 0.274025 0.264508 0.281774 0.223127 0.255476 0.311981 0.317279
chargesum: 0.00000
title: Mulliken charges with hydrogens summed into heavy atoms:
elementType: Br O N C C C C C C C C C C C C C
charge: 0.014705 -0.157729 -0.066602 0.269185 0.292345 0.242669 0.230325 -0.313718 -0.131411 -0.354094 -0.077165 -0.128483 0.543745 -0.212488 -0.203733 0.052450
polarizability: 3.26234549e+02 1.03009505e+01 1.81555014e+02 -1.07614820e-02 -5.27481473e-03 5.98007312e+01
1716.lowfreq: -0.6986 -0.0006 -0.0003 0.0004 2.1400 4.6190 56.5318 90.8408 102.8487
frequency: 56.5281 90.8406 102.8478 140.6177 173.5984 219.5733 224.6262 242.5660 294.8250 332.4973 365.9743 391.9639 411.3360 411.4393 418.9792 441.4710 514.4534 540.2835 564.0276 590.0825 597.3837 653.0870 681.9717 725.1009 746.5288 769.1374 801.0482 829.9888 838.4356 849.1126 891.8494 913.0176 950.8823 951.5600 973.8993 1009.8844 1037.8919 1047.7686 1080.0887 1111.6691 1149.9405 1186.0187 1218.8762 1263.3054 1278.9780 1325.9580 1360.6319 1394.9161 1401.3668 1446.3730 1475.4478 1500.5871 1578.0369 1590.6087 1601.3307 1626.4189 1639.6940 1648.2431 3123.6817 3134.8749 3147.0976 3151.1815 3162.5032 3178.0643 3562.8027 3702.6160
redmass: 6.1188 6.2531 8.4434 4.6874 5.2474 8.6367 10.9694 6.0207 6.7080 4.5273 3.6845 1.0678 1.2808 5.5628 2.6443 2.9942 6.2747 5.4874 6.5022 7.9452 3.3982 7.5427 3.5710 6.5750 6.6897 3.3979 2.0101 1.5429 6.9976 1.8205 1.5596 1.9232 3.3891 1.4023 1.4391 3.5897 1.6862 2.1595 2.8441 1.8691 1.4832 2.2624 1.9137 1.3285 1.9834 2.3461 9.6157 3.2535 3.3702 2.8593 6.4483 4.3353 8.0786 7.8751 8.0380 7.4710 3.1934 1.5616 1.0874 1.0924 1.0966 1.0902 1.0927 1.0959 1.0451 1.1041
irintensity: 0.7098 5.1741 0.8814 0.0596 0.0164 1.5069 2.3384 1.6216 3.1502 0.9489 5.2105 0.7148 321.3010 12.1187 3.6468 1.5144 0.7539 1.2410 1.7304 8.0010 18.3812 1.9871 2.3099 5.8992 6.2836 0.0002 49.1971 42.9755 87.5323 7.1486 8.8753 31.5300 35.4976 0.1156 3.4271 27.9445 0.8983 34.9029 1.5485 24.1491 28.2696 14.3376 18.2614 2.9531 9.8980 97.6505 6.0157 26.8709 16.7804 78.8685 70.1535 187.2809 223.6491 145.6556 189.2340 106.4507 34.8833 293.0613 15.2919 10.8710 19.6310 2.1285 2.9643 2.3927 142.9608 24.4028
temp: 298.150 k
press: 1.00000 atm
elementType: 35 8 7 6 6 6 6 6 6 6 6 6 6 6 6 6 1 1 1 1 1 1 1 1
symmnumber: 1
zpe: 453614.3 jmol-1
zpe.correction: 0.172773 hartree
zpe.thermalcorrener: 0.185621 hartree
zpe.thermalcorrenthalpy: 0.186565 hartree
zpe.thermalcorrgfe: 0.132662 hartree
zpe.sumelectzpe: -642.559067 hartree
zpe.sumelectthermal: -642.546219 hartree
zpe.sumelectthermalent: -642.545274 hartree
zpe.sumelectthermalfe: -642.599178 hartree
dipole: -3.9469 -3.4888 0.0022
dipole: 5.2678
quadrupole: -70.5786 -99.3650 -106.7355
quadrupole: 16.7263 -0.0133 -0.0011
quadrupole: 21.6478 -7.1387 -14.5091 16.7263 -0.0133 -0.0011
hfenergy: -642.7318398 hartree
pointgroup: C01 [X(C13H8Br1N1O1)]
dipole: 1.7748623 1.0701115 0.0008551 debye
dipolederiv: -0.6670074 0.3381057 -0.0000146 0.4628924 -0.3211782 0.0000233 0.0000639 -0.0000161 -0.0349825 -0.5574637 0.1296128 -0.0000016 0.1442822 -1.1145635 -0.000044 0.0000138 -0.0001525 -0.3022814 -2.0199639 -0.0086118 0.0001903 0.0494368 -0.0784328 0.0000125 0.0007729 0.0000432 -0.7331195 -0.5978895 0.0874084 -0.0000156 -0.0622488 -0.1665744 0.0000051 0.0000753 -0.0000124 -0.0639614 1.0936894 -0.033302 0.0000291 -0.0134946 0.1355191 0.0000069 0.0000323 0.0000618 0.0302228 -0.1936148 -0.4216777 -0.0000524 -0.3461482 -0.2013529 -0.0000627 -0.0000112 -0.0000018 0.0556395 -0.9372601 0.2515015 -0.0000413 -0.1536872 -0.2847689 -0.0000181 -0.0002283 0.0000213 0.0210386 1.3556437 -0.1274446 0.0000496 -0.0987001 1.3247711 0.0001043 0.0001031 0.0001214 0.1063597 0.3718004 0.0274627 0.0000079 0.0951973 0.148402 0.0000044 0.0000702 -0.0000203 -0.1053769 -0.3909767 0.1331865 -0.0000342 -0.5568261 0.0761965 0.0000101 -0.0002146 0.0000656 -0.1894886 -0.9786508 0.1749954 0.0000052 0.3513936 -0.0420627 0.0000084 0.0000757 -0.0000205 -0.1132593 0.471856 -0.1389343 0.0000463 0.1337467 0.1470177 0.0000114 0.0001101 -0.0000015 -0.1042884 2.0599609 0.0168814 0.0000417 -0.085511 -0.0697477 0.0000105 0.000191 0.0000218 0.1461875 -0.5571586 -0.0356726 -0.0000824 0.5968254 0.0612237 -0.0000438 -0.0003225 -0.0001033 -0.2238076 1.3195299 -0.5889536 0.0000042 -0.7239426 0.5769457 -0.0000477 -0.0000202 0.0000054 -0.1033545 -0.4454517 0.2265493 -0.0000068 0.2811358 -0.3506912 0.0000333 -0.0001353 0.0000263 -0.1368175 0.0638101 0.0976141 -0.0000019 0.0578218 -0.0500434 0.0000037 0.0000644 -0.0000015 0.1467411 0.0205946 0.0498384 0.0000141 0.0863336 -0.00382 -0.0000097 0.0000242 -0.000033 0.1701854 0.096202 -0.0375426 -0.0000031 -0.0163954 -0.0382286 -0.000013 0.0000033 -0.000015 0.1586428 0.0755025 0.019463 -0.0000075 -0.0368667 -0.033322 -0.0000088 -0.0000064 -0.0000116 0.1599032 -0.0427442 -0.1118733 0.0000253 -0.1118811 -0.0444489 0.0000189 0.0000147 0.0000626 0.1682495 -0.0457762 -0.0455191 -0.0000005 -0.0367295 0.0878257 0.0000028 0. -0.0000001 0.1705582 0.2494352 0.0175022 -0.0000776 0.0752953 0.1207544 -0.0000474 -0.0003418 -0.0001334 0.3885585 0.2559329 -0.02059 -0.0000741 -0.0919297 0.1205793 0.0000396 -0.0003347 0.0000937 0.3884509 unknown
polarizability: 325.1848841|-16.0272523|182.6046789|0.0115362|0.0032481|59.8007312 unknown
InChI: InChI=1S/C13H8BrNO/c14-7-1-3-10-11(5-7)9-4-2-8(15)6-12(9)13(10)16/h1-6H,15H2
charge 0 multiplicity 1
24 atoms
Br -4.801639 1.888788 0.000042
O  0.482075 -2.973597 -0.000139
N  4.837303 0.429847 0.00039
C  0.60172 0.635985 0.000298
C  -0.857581 0.377701 0.000142
C  1.281347 -0.619576 0.000258
C  -1.071903 -1.037051 0.000158
C  0.260583 -1.730516 0.00017
C  1.356859 1.822476 0.000288
C  2.673867 -0.718642 0.00022
C  -1.956137 1.257018 0.000155
C  -2.361978 -1.585676 0.000076
C  3.446264 0.487146 0.000291
C  2.768782 1.745349 0.000265
C  -3.251842 0.682793 0.000057
C  -3.479917 -0.711509 0.000007
H  0.873239 2.805665 0.00026
H  3.156423 -1.702981 0.000072
H  -1.829434 2.343149 0.000248
H  -2.50193 -2.671521 0.00003
H  3.361012 2.668495 0.00005
H  -4.500148 -1.103748 -0.000048
H  5.396141 1.27829 0.000928
H  5.321594 -0.463289 0.000882
