program: Gaussian 09
title: 000259941
version: EM64L-G09RevD.01
frameworkgroup: C1[X(C19H14N2)]
method: RPBEPBE
basis: SDD
operation: Freq
keyword: #pfreq=noraman
keyword: PBEPBE/SDD
title: #p freq=noraman PBEPBE/SDD
converged: YES YES NO NO
title: Mulliken charges:
elementType: N N C C C C C C C C C C C C C C C C C C C H H H H H H H H H H H H H H
charge: -0.706671 0.009896 0.055138 0.173034 0.161641 0.337733 0.107073 -0.606330 -0.390307 -0.429768 -0.366084 -0.443612 0.546938 -0.457544 -0.235152 -0.274791 0.394377 -0.326806 -0.514296 -0.190821 -0.350267 0.227552 0.242025 0.245342 0.269284 0.229162 0.218241 0.225335 0.228193 0.306846 0.305653 0.246229 0.287965 0.230617 0.244177
chargesum: 0.00000
title: Mulliken charges with hydrogens summed into heavy atoms:
elementType: N N C C C C C C C C C C C C C C C C C C C
charge: -0.094172 0.009896 0.055138 0.173034 0.161641 0.337733 0.107073 -0.378778 -0.148282 -0.184426 -0.096800 -0.214451 0.546938 -0.239304 -0.009817 -0.046598 0.394377 -0.080577 -0.226331 0.039796 -0.106090
polarizability: 3.78657316e+02 -4.64270915e+00 2.86618214e+02 6.88008122e+00 1.06033677e+01 1.01374864e+02
1716.lowfreq: -7.4043 -5.0815 -1.8992 -0.0004 -0.0001 0.0006 36.0874 44.2150 61.9634
frequency: 36.0154 44.2067 61.9571 85.4463 134.8862 146.4569 149.3631 192.7726 206.0227 261.7409 313.9478 332.9857 341.3487 350.8238 361.7117 394.3337 397.2062 413.6873 435.9847 467.8182 508.0380 528.1089 539.9353 569.1111 588.3624 600.4984 618.4402 654.6123 666.8787 719.3770 720.0190 736.3406 748.1919 776.3508 779.7322 794.0192 808.1089 821.2540 852.6021 869.7302 872.4083 882.2229 925.7845 942.3144 945.7454 958.9649 965.0555 984.6269 986.5645 994.6949 1003.8222 1028.2917 1030.7751 1040.9248 1077.5186 1113.4368 1125.3722 1141.9109 1168.9787 1188.4803 1198.1009 1228.9455 1239.8549 1273.3393 1304.0029 1306.0795 1330.1195 1333.3012 1357.4351 1376.5893 1398.1116 1410.0304 1445.8837 1453.0917 1460.2240 1472.9728 1497.7132 1538.7625 1577.0899 1582.2904 1591.3847 1610.4155 1629.8932 1641.0378 1645.0084 3073.1039 3112.6943 3120.1999 3123.5198 3128.1628 3136.7797 3137.9667 3142.4157 3144.9040 3154.8028 3165.5359 3173.0292 3568.1564 3708.7685
redmass: 4.5213 4.6195 5.3412 5.0202 3.7118 5.2336 4.8601 4.6923 4.4553 4.5898 3.4623 3.4382 3.9925 1.3620 1.0809 3.6349 3.1921 3.6175 2.8811 4.1017 3.4204 4.5866 6.7617 6.3493 3.1732 6.5897 7.0194 3.3491 6.2303 3.4668 2.6009 1.9973 4.3006 1.6697 3.1143 6.9953 1.7598 1.6245 2.1209 2.0173 2.2843 1.6284 1.3369 1.5317 1.3962 1.7037 2.0345 1.3668 1.3943 5.2685 3.7890 2.9862 1.9210 1.6853 2.9437 1.6642 1.7063 1.5647 1.2749 1.5937 1.3515 1.6121 2.4026 1.6064 5.5696 1.7451 2.8741 1.5234 1.7176 4.6132 2.9332 1.9874 2.6212 2.5543 2.6948 4.3558 4.4489 5.0158 5.7584 6.4452 6.9211 7.0641 4.1133 1.5966 3.8858 1.0866 1.0909 1.0870 1.0857 1.0874 1.0916 1.0909 1.0924 1.0964 1.0957 1.1001 1.0967 1.0448 1.1040
irintensity: 0.9211 0.1078 0.5387 4.4559 0.0692 1.9455 0.5156 0.3631 0.4291 1.0743 4.1537 20.7212 8.1869 243.4180 39.8264 0.5168 4.8825 1.4522 0.4972 7.0481 0.6454 2.6952 0.8623 6.7148 2.5311 4.5438 4.5478 0.3421 0.2993 14.8094 26.8979 37.2560 2.8835 45.6187 8.9985 7.4480 23.4318 23.3489 29.0778 24.8891 15.2648 6.9875 1.0335 7.5756 0.0451 0.9248 5.5643 1.2201 0.4532 0.6536 7.8022 1.2433 4.0306 0.2719 7.1891 10.0605 5.8647 11.4996 0.0664 2.1627 2.3168 17.9099 5.0294 2.5710 2.7394 4.8185 78.8854 4.5174 4.2753 11.9182 1.0671 18.4082 36.8929 51.5594 37.5132 33.2881 103.8773 6.9209 4.4810 3.1645 14.7505 72.4894 47.6458 132.6535 201.5351 11.2718 18.0725 22.6322 1.1147 1.6320 19.7160 5.0007 16.4995 35.5946 34.5697 38.7045 16.4875 109.5734 19.7410
temp: 298.150 k
press: 1.00000 atm
elementType: 7 7 6 6 6 6 6 6 6 6 6 6 6 6 6 6 6 6 6 6 6 1 1 1 1 1 1 1 1 1 1 1 1 1 1
symmnumber: 1
zpe: 718943.9 jmol-1
zpe.correction: 0.273831 hartree
zpe.thermalcorrener: 0.290186 hartree
zpe.thermalcorrenthalpy: 0.291130 hartree
zpe.thermalcorrgfe: 0.229555 hartree
zpe.sumelectzpe: -840.520691 hartree
zpe.sumelectthermal: -840.504337 hartree
zpe.sumelectthermalent: -840.503392 hartree
zpe.sumelectthermalfe: -840.564967 hartree
dipole: 2.6323 -3.9220 -1.5819
dipole: 4.9813
quadrupole: -101.5294 -97.6833 -130.8229
quadrupole: -2.2746 10.0021 2.0358
quadrupole: 8.4824 12.3286 -20.8110 -2.2746 10.0021 2.0358
hfenergy: -840.7945227 hartree
pointgroup: C01 [X(C19H14N2)]
dipole: -1.1246502 1.4010939 -0.7828779 debye
polarizability: 378.6400897|-1.2160933|280.9623164|-10.3805444|-33.0528999|107.0479882 unknown
InChI: InChI=1S/C19H14N2/c20-14-7-8-17-15-5-1-2-6-16(15)18(19(17)11-14)10-13-4-3-9-21-12-13/h1-12H,20H2
charge 0 multiplicity 1
35 atoms
N  -4.366939 2.971629 -0.200788
N  4.36902 0.424607 0.910347
C  -1.561146 0.525222 -0.084048
C  -2.273378 -0.69682 0.123703
C  -1.295606 -1.794638 0.191841
C  -0.09409 0.236087 -0.118267
C  0.026326 -1.245115 0.045818
C  -2.242289 1.749593 -0.187632
C  -3.678775 -0.681904 0.22108
C  -1.48982 -3.183194 0.33266
C  1.138608 -2.11333 0.001423
C  0.848791 1.218549 -0.323044
C  -3.666456 1.767186 -0.094957
C  -4.371772 0.541205 0.110331
C  -0.362873 -4.039568 0.309923
C  0.938783 -3.509475 0.13415
C  2.317816 1.172604 -0.237503
C  3.115163 1.964883 -1.112395
C  3.013804 0.447562 0.777605
C  4.519325 1.95319 -0.988903
C  5.106414 1.158298 0.022559
H  -1.702264 2.693545 -0.333003
H  -4.241367 -1.607999 0.383091
H  -2.496636 -3.600078 0.446935
H  2.152105 -1.731109 -0.142996
H  0.45455 2.215121 -0.57409
H  -5.465923 0.559885 0.184645
H  -0.49806 -5.12167 0.419368
H  1.801563 -4.183557 0.102572
H  -5.379654 2.991704 -0.130561
H  -3.877172 3.850513 -0.337412
H  2.631332 2.569052 -1.888944
H  2.452906 -0.111981 1.533783
H  5.150329 2.544816 -1.659736
H  6.194085 1.106886 0.145249
