program: Gaussian 09
title: 000259878
version: EM64L-G09RevD.01
frameworkgroup: C1[X(C10H11ClN2O3)]
method: RPBEPBE
basis: SDD
operation: Freq
keyword: #p
keyword: freq=noraman
keyword: PBEPBE/SDD
title: #p freq=noraman PBEPBE/SDD
converged: YES YES NO NO
title: Mulliken charges:
elementType: Cl O O O N N C C C C C C C C C C H H H H H H H H H H H
charge: -0.080682 -0.291774 -0.448031 -0.256662 -0.484450 -0.409101 0.490827 -0.327004 -0.330698 -0.440095 0.265021 -0.356264 -0.308772 0.299032 -0.551655 0.104236 0.271627 0.247983 0.311923 0.220292 0.296231 0.299690 0.270149 0.273779 0.281225 0.271264 0.381908
chargesum: 0.00000
title: Mulliken charges with hydrogens summed into heavy atoms:
elementType: Cl O O O N N C C C C C C C C C C
charge: -0.080682 -0.291774 -0.066124 -0.256662 -0.188219 -0.109411 0.490827 0.192606 -0.018775 -0.219803 0.265021 -0.086114 -0.034993 0.299032 0.000834 0.104236
polarizability: 2.59077052e+02 2.46375424e+00 1.40984438e+02 1.23791266e+01 8.66779124e+00 6.91367310e+01
1716.lowfreq: -0.0031 -0.0025 -0.0021 3.0724 5.0587 12.3361 17.1477 39.7463 53.4212
frequency: 17.1392 39.5019 53.3909 62.2324 82.0533 96.2589 105.2592 139.9535 181.1366 237.7480 249.4810 288.1326 316.7807 365.4400 406.0736 414.3485 428.5907 481.5230 491.0910 513.7130 583.6948 585.4006 598.8430 618.7647 627.3300 687.4414 706.0796 710.3933 730.1776 760.9974 824.5293 837.2389 859.3084 886.5256 962.6319 975.4770 988.7457 994.4589 1011.9574 1018.6541 1042.0392 1124.9446 1128.7019 1151.7834 1169.0323 1197.5367 1211.9822 1236.5790 1277.4104 1298.0484 1306.8989 1322.3530 1365.7545 1375.7445 1427.7559 1440.8769 1448.6255 1483.7822 1498.7174 1517.8700 1584.5315 1623.4540 1643.4370 1649.0661 2997.0156 3055.4193 3067.8497 3115.3908 3155.7564 3157.1341 3178.8785 3199.2760 3520.9142 3533.7724 3540.0846
redmass: 8.2336 6.0890 8.6655 6.9945 5.1681 5.5584 5.9087 4.2746 7.2377 3.9532 8.8228 4.0148 3.2058 4.5571 2.2920 2.9838 2.2457 2.6579 6.2883 2.4216 3.9473 1.2914 3.8661 1.3062 5.9533 3.7039 10.4307 4.7191 4.6779 4.5193 3.6833 1.4248 2.6084 1.4814 2.4315 1.3676 2.5560 4.8319 1.3253 2.7141 1.9129 1.9840 1.7788 1.6203 1.3916 1.1921 1.5445 1.3816 2.1005 1.1960 1.4777 2.7049 1.6800 2.6641 4.6456 1.1060 1.0988 1.7433 2.2068 3.0296 5.6097 5.6050 8.4493 4.5201 1.0599 1.0937 1.0650 1.0903 1.1121 1.0911 1.0945 1.0949 1.0763 1.0641 1.0771
irintensity: 1.9438 1.8285 1.8173 6.0609 0.4970 7.4276 3.9927 4.1016 0.8161 6.4224 2.9673 1.2046 12.1841 29.4083 5.9150 0.5268 11.2952 10.8604 7.0478 107.0416 25.7968 54.1991 39.2989 159.1929 9.7593 87.2870 7.8876 6.5295 6.6618 21.4268 3.1242 32.7281 17.4804 54.6021 11.7656 0.1171 9.0266 206.7868 0.8104 179.2643 5.4370 10.4592 10.1326 224.1729 24.1610 16.9188 153.9105 324.0688 6.4096 48.0953 4.1905 178.4763 106.7516 190.6502 28.8279 7.5024 38.3882 182.1319 387.2993 485.1924 95.7071 164.6443 327.0203 159.6078 53.8192 6.1074 20.9323 19.4649 15.7342 1.6661 1.8673 5.0665 4.4107 52.6812 51.0210
temp: 298.150 k
press: 1.00000 atm
elementType: 17 8 8 8 7 7 6 6 6 6 6 6 6 6 6 6 1 1 1 1 1 1 1 1 1 1 1
symmnumber: 1
zpe: 532259.9 jmol-1
zpe.correction: 0.202727 hartree
zpe.thermalcorrener: 0.218262 hartree
zpe.thermalcorrenthalpy: 0.219206 hartree
zpe.thermalcorrgfe: 0.156974 hartree
zpe.sumelectzpe: -1181.766172 hartree
zpe.sumelectthermal: -1181.750637 hartree
zpe.sumelectthermalent: -1181.749693 hartree
zpe.sumelectthermalfe: -1181.811925 hartree
dipole: -3.5502 -3.0328 -0.9413
dipole: 4.7632
quadrupole: -102.3517 -100.1771 -101.8339
quadrupole: -16.8754 0.6113 2.6831
quadrupole: -0.8975 1.2772 -0.3796 -16.8754 0.6113 2.6831
hfenergy: -1181.9688995 hartree
pointgroup: C01 [X(C10H11Cl1N2O3)]
dipole: 1.3406404 -1.2961517 0.1857114 debye
polarizability: 258.8013289|-9.5635077|142.645612|8.5570421|0.6338002|67.7512798 unknown
InChI: InChI=1S/C10H11ClN2O3/c11-5-6-12-10(16)13-8-3-1-7(2-4-8)9(14)15/h1-4,12-14H,5-6H2
charge 0 multiplicity 1
27 atoms
Cl 6.121559 -1.457241 -0.7259
O  1.995695 1.587712 0.380396
O  -5.280014 -1.001729 -0.191134
O  -5.12139 1.315489 -0.232297
N  1.107474 -0.607343 0.355539
N  3.417323 -0.261725 0.512134
C  -0.279505 -0.355658 0.229962
C  4.631326 0.553918 0.56495
C  -0.835328 0.953139 0.149947
C  -1.142204 -1.489583 0.182901
C  -3.089028 -0.02401 -0.023206
C  -2.226483 1.102547 0.024438
C  -2.529673 -1.326655 0.058021
C  2.157404 0.33134 0.411488
C  5.533905 0.352637 -0.652177
C  -4.545124 0.201285 -0.155561
H  4.301748 1.609953 0.595034
H  5.19924 0.34409 1.490882
H  -0.171897 1.818161 0.188519
H  -0.718006 -2.500242 0.243808
H  1.362752 -1.595691 0.417232
H  3.543212 -1.274657 0.458074
H  -2.670011 2.101825 -0.037999
H  -3.190941 -2.196428 0.021781
H  5.007844 0.523411 -1.602151
H  6.455157 0.950199 -0.588961
H  -6.243934 -0.774446 -0.280519
