program: Gaussian 09
title: 000259899
version: EM64L-G09RevD.01
frameworkgroup: C1[X(C15H15NO2S)]
method: RPBEPBE
basis: SDD
operation: Freq
keyword: #p
keyword: freq=noraman
keyword: PBEPBE/SDD
title: #p freq=noraman PBEPBE/SDD
converged: YES YES NO NO
title: Mulliken charges:
elementType: S O O N C C C C C C C C C C C C C C C H H H H H H H H H H H H H H H
charge: 0.952168 -0.523626 -0.537937 -0.197948 -0.575552 -0.565007 0.282442 0.259369 -0.094627 -0.394396 -0.398746 -0.223055 -0.222924 -0.217822 -0.250783 -0.342117 -0.395782 0.450274 -0.800117 0.270872 0.260415 0.298067 0.263418 0.241135 0.246117 0.228062 0.229177 0.273424 0.295094 0.242361 0.244075 0.228508 0.232631 0.242829
chargesum: 0.00000
title: Mulliken charges with hydrogens summed into heavy atoms:
elementType: S O O N C C C C C C C C C C C C C C C
charge: 0.952168 -0.523626 -0.537937 -0.197948 -0.044265 -0.003523 0.282442 0.259369 -0.094627 -0.153260 -0.152628 0.005007 0.006254 0.055603 0.044310 -0.099756 -0.151707 0.450274 -0.096149
polarizability: 2.03285395e+02 -1.67688061e+01 2.08928376e+02 -2.32379691e+01 -1.16839763e+01 1.65471731e+02
1716.lowfreq: -18.4002 -10.1201 -0.0015 -0.0006 0.0011 2.0687 4.3745 11.0165 28.0689
frequency: -5.1461 7.5580 27.6687 54.2321 61.5830 109.6140 121.0769 140.3348 202.3682 215.0730 222.9823 258.9539 272.5808 284.1245 316.4788 351.7021 371.3726 399.1416 408.3114 412.6763 420.3683 453.5784 491.1320 505.3926 532.5001 579.9412 590.8458 620.5867 698.2313 700.8408 707.9013 749.3164 774.8595 794.1604 810.1891 824.3238 831.7050 838.0216 849.2104 868.0098 930.7017 944.4877 955.8661 961.6367 981.1109 987.0107 987.5811 988.8556 994.7838 1022.1855 1022.4732 1045.9510 1048.9750 1097.1812 1119.4854 1148.7378 1170.5702 1171.7993 1184.5555 1189.5683 1218.0054 1223.4458 1243.1764 1289.5343 1296.2432 1303.5263 1378.8074 1389.6132 1393.7724 1398.7430 1444.4056 1446.0979 1449.1644 1469.7192 1470.1416 1471.1235 1474.9290 1591.4104 1594.2081 1597.4366 1620.4879 2967.2643 2979.5817 2981.8576 3015.7442 3043.1187 3062.2222 3092.6813 3124.4216 3132.2258 3133.9271 3135.8292 3145.0425 3157.5182 3162.9484 3164.4219
redmass: 1.0603 4.1263 5.0777 3.9381 5.1427 5.0775 4.9301 4.8797 7.3846 5.2353 8.1333 5.4545 3.6232 4.0599 3.5168 2.7016 3.6189 5.6704 2.8782 2.9205 4.5075 7.1094 2.8252 3.3337 5.9949 6.0467 5.9929 6.9595 4.2412 4.0044 3.3688 1.2577 4.9781 4.8350 6.0309 1.4320 4.6447 4.8474 1.2436 1.2973 1.4269 9.2693 2.2159 1.3105 1.4516 1.7783 1.4678 1.5928 2.8091 4.0295 2.9296 2.4446 1.5913 2.2543 1.2976 1.1062 1.1478 2.0121 1.1511 1.1912 2.9893 2.0287 1.2585 1.6785 1.2689 1.3824 4.7582 3.1936 5.9242 1.2615 1.1912 1.7357 1.2989 1.1085 2.1043 2.2157 1.0963 6.6244 6.0750 6.8089 7.1589 1.0598 1.0652 1.0381 1.1014 1.0968 1.0963 1.0992 1.0853 1.0897 1.0892 1.0889 1.0950 1.0959 1.1005 1.0961
irintensity: 0.3086 0.8417 0.3295 0.0928 0.9946 1.5397 0.2340 0.2608 0.5721 5.6784 4.2771 16.7872 1.0594 1.1954 3.7388 5.4905 2.0783 12.9757 1.0976 14.3181 10.7023 55.9774 1.1186 71.8804 8.6321 23.7530 1.9588 0.3963 2.5179 2.4085 1.4399 69.0016 3.3054 8.8237 127.7501 24.6587 26.5463 0.1441 0.9648 0.5279 1.4146 65.7885 4.2910 1.3485 1.2565 6.8151 3.4666 14.8556 2.8583 5.0887 4.7792 23.1756 16.8731 0.6254 7.0285 0.1741 3.7400 3.2472 19.2665 15.3127 6.9299 4.7110 4.1713 7.4935 2.7603 1.5035 2.3753 8.8967 5.6635 15.3356 42.9588 3.0058 11.4095 10.3252 19.0349 15.3186 15.0003 3.5153 7.1813 1.6248 0.1337 13.9092 17.2057 24.1771 5.0099 3.8644 15.6190 16.3004 0.8945 3.6619 11.3594 7.5560 26.1207 6.0251 27.4845 4.8087
temp: 298.150 k
press: 1.00000 atm
elementType: 16 8 8 7 6 6 6 6 6 6 6 6 6 6 6 6 6 6 6 1 1 1 1 1 1 1 1 1 1 1 1 1 1 1
symmnumber: 1
zpe: 687226.3 jmol-1
zpe.correction: 0.261751 hartree
zpe.thermalcorrener: 0.278600 hartree
zpe.thermalcorrenthalpy: 0.279545 hartree
zpe.thermalcorrgfe: 0.214950 hartree
zpe.sumelectzpe: -1182.316640 hartree
zpe.sumelectthermal: -1182.299790 hartree
zpe.sumelectthermalent: -1182.298846 hartree
zpe.sumelectthermalfe: -1182.363441 hartree
dipole: -1.2391 7.6531 1.1195
dipole: 7.8332
quadrupole: -104.3240 -134.6811 -115.0246
quadrupole: -5.2029 -4.5937 -4.3040
quadrupole: 13.6859 -16.6712 2.9853 -5.2029 -4.5937 -4.3040
hfenergy: -1182.5783907 hartree
pointgroup: C01 [X(C15H15N1O2S1)]
dipole: -0.6554466 2.9875284 -0.3777127 debye
polarizability: 185.6709247|10.8354995|219.286836|-28.6380469|0.990385|172.7277415 unknown
InChI: InChI=1S/C15H15NO2S/c1-12-6-8-15(9-7-12)19(17,18)16-10-13-4-2-3-5-14(13)11-16/h2-9H,10-11H2,1H3
charge 0 multiplicity 1
34 atoms
S  0.909268 -2.188063 0.18693
O  1.707926 -3.084277 -0.905298
O  0.865738 -2.565585 1.776571
N  -0.979639 -2.27215 -0.397072
C  -1.248634 -1.191745 -1.420435
C  -1.861507 -1.971489 0.787433
C  -1.896423 -0.049827 -0.649121
C  -2.264752 -0.510923 0.640012
C  1.613067 -0.431531 0.041488
C  -2.167168 1.273293 -1.045489
C  -2.908765 0.34633 1.552812
C  -2.809507 2.141017 -0.127363
C  -3.177549 1.681576 1.160566
C  1.391026 0.4754 1.091348
C  2.372431 -0.121957 -1.097867
C  1.95524 1.763122 0.977377
C  2.925458 1.176052 -1.188155
C  2.724471 2.133281 -0.159715
C  3.340407 3.517278 -0.251558
H  -1.943805 -1.631629 -2.163366
H  -0.330165 -0.915172 -1.969367
H  -1.318071 -2.220535 1.72063
H  -2.729648 -2.657843 0.721033
H  -1.88448 1.633904 -2.041085
H  -3.196134 -0.006524 2.549743
H  -3.023078 3.176494 -0.415338
H  -3.672982 2.364904 1.859375
H  0.81578 0.179524 1.974214
H  2.549645 -0.882594 -1.865679
H  1.797996 2.489653 1.783044
H  3.525694 1.443083 -2.065399
H  3.716772 3.729401 -1.266485
H  2.609743 4.302503 0.013919
H  4.192645 3.616925 0.447595
