program: Gaussian 09
title: 000259858
version: EM64L-G09RevD.01
frameworkgroup: C1[X(C12H14N6O)]
method: RPBEPBE
basis: SDD
operation: Freq
keyword: #p
keyword: freq=noraman
keyword: PBEPBE/SDD
title: #p freq=noraman PBEPBE/SDD
converged: YES YES NO NO
title: Mulliken charges:
elementType: O N N N N N N C C C C C C C C C C C C H H H H H H H H H H H H H H
charge: -0.348601 -0.459617 -0.148272 -0.141312 -0.655486 -0.583834 -0.654242 0.412884 0.206494 -0.096991 0.454225 -0.456568 -0.327172 -0.370485 -0.392883 0.167467 -0.009054 0.187245 -0.813336 0.376115 0.237608 0.301090 0.226866 0.221689 0.222150 0.221757 0.232525 0.329580 0.333270 0.327895 0.329048 0.336095 0.333854
chargesum: 0.00000
title: Mulliken charges with hydrogens summed into heavy atoms:
elementType: O N N N N N N C C C C C C C C C C C C
charge: -0.348601 -0.083503 -0.148272 -0.141312 0.007364 0.073109 0.015706 0.412884 0.206494 -0.096991 0.454225 -0.218960 -0.026082 -0.143619 -0.171194 0.167467 -0.009054 0.187245 -0.136904
polarizability: 3.15387363e+02 -1.19611829e+00 2.17629039e+02 -4.02863824e-01 2.93472014e+00 7.88039052e+01
1716.lowfreq: -20.0171 -4.2770 -0.0005 -0.0003 0.0005 4.2919 4.9057 36.7425 43.1577
frequency: -19.2825 36.7308 43.1531 76.8423 83.0192 108.6433 143.6160 198.3718 206.3026 228.7415 231.7326 243.4867 283.9701 326.5350 340.3599 351.7536 355.3620 379.4271 408.2175 412.1878 463.3829 503.9387 518.0576 535.6925 544.6940 568.8340 578.1052 590.6258 601.4580 634.3632 665.6304 691.5750 706.8324 720.6010 733.1420 743.2566 761.1879 763.5521 788.8595 825.1901 835.7479 851.1576 942.7352 950.7489 965.3046 984.4390 987.7271 995.5267 1010.1291 1045.6635 1060.8779 1113.9318 1125.6195 1133.6709 1154.3841 1190.4128 1222.9438 1273.1396 1276.1832 1315.1147 1351.9370 1371.0009 1395.5924 1400.0439 1413.5602 1428.2795 1470.2679 1472.3486 1473.3000 1498.0312 1521.6106 1538.9668 1560.2489 1575.1116 1597.1786 1603.9971 1618.0019 1628.7977 1659.7568 2969.4083 3049.3198 3079.2570 3103.2560 3113.7554 3117.7884 3137.8977 3199.1131 3484.2199 3501.1994 3560.9238 3643.1029 3651.7221 3720.7236
redmass: 1.0229 3.9997 4.4427 5.2758 5.0026 5.5886 4.9312 6.0585 6.7940 5.3847 4.0900 3.6229 5.1067 3.1262 1.9151 3.1424 2.2873 4.7610 4.5097 2.9890 1.2172 4.9123 2.5583 1.0577 6.5547 3.8168 2.0024 1.6446 1.5284 6.6892 6.9473 4.8866 5.2373 3.0813 8.8782 6.4376 1.5887 1.9925 6.3191 1.4699 5.5578 1.2904 1.2450 2.5881 1.2182 1.4767 1.3336 3.5316 2.8267 1.5435 1.9713 1.7025 2.2224 2.0635 2.8948 1.1144 2.6969 3.6868 3.3748 1.4903 5.2286 5.1607 1.2637 4.4119 3.8246 4.6654 3.3112 1.0926 1.1547 2.9619 3.1655 5.5729 4.9022 4.7712 1.3348 1.2506 1.6540 6.1814 1.6499 1.0388 1.0946 1.0996 1.0835 1.0872 1.0906 1.0970 1.0935 1.0457 1.0445 1.0441 1.1035 1.1035 1.1058
irintensity: 0.5256 1.1756 2.1639 0.3600 1.2464 6.9886 2.2735 8.5516 5.1359 5.1082 4.5399 24.3833 5.5379 14.6729 54.6239 4.4176 26.9492 3.8612 2.3186 0.2756 260.2945 8.3535 33.5769 1.0488 2.7113 38.5509 44.6147 107.7113 158.1132 0.0513 28.8449 21.8378 3.5877 1.4599 1.0757 2.8208 86.0505 25.1758 42.4573 25.6482 7.3930 26.7738 27.4996 17.7142 90.7619 0.9785 2.1504 4.5316 2.8241 23.1797 24.8137 7.0805 0.7223 6.9397 2.0412 1.5876 0.4056 48.7871 17.7532 6.6784 36.6800 87.7765 3.1961 205.4094 103.1150 218.9948 161.2050 17.2274 2.4866 316.0374 13.3124 252.2240 1568.4310 126.1052 175.1815 630.2222 103.0590 9.3898 237.5674 61.8674 26.7205 18.5958 277.1699 25.8207 24.8049 20.9150 7.5506 55.8081 49.0916 120.5378 55.3167 31.6901 43.9289
temp: 298.150 k
press: 1.00000 atm
elementType: 8 7 7 7 7 7 7 6 6 6 6 6 6 6 6 6 6 6 6 1 1 1 1 1 1 1 1 1 1 1 1 1 1
symmnumber: 1
zpe: 680331.9 jmol-1
zpe.correction: 0.259125 hartree
zpe.thermalcorrener: 0.275686 hartree
zpe.thermalcorrenthalpy: 0.276631 hartree
zpe.thermalcorrgfe: 0.214990 hartree
zpe.sumelectzpe: -868.122345 hartree
zpe.sumelectthermal: -868.105783 hartree
zpe.sumelectthermalent: -868.104839 hartree
zpe.sumelectthermalfe: -868.166480 hartree
dipole: -3.7028 1.3352 0.5285
dipole: 3.9715
quadrupole: -79.3918 -95.8545 -115.8839
quadrupole: 6.0335 -0.5142 -1.2817
quadrupole: 17.6516 1.1889 -18.8405 6.0335 -0.5142 -1.2817
hfenergy: -868.38147 hartree
pointgroup: C01 [X(C12H14N6O1)]
dipole: -1.4703249 -0.4096443 -0.3343691 debye
polarizability: 314.4546381|-5.8237513|215.6291942|12.8592254|17.3922695|81.7364742 unknown
InChI: InChI=1S/C12H14N6O/c1-6-2-4-7(5-3-6)16-11-8(10(14)19)9(13)17-12(15)18-11/h2-5,16H,13-15H2,1H3
charge 0 multiplicity 1
33 atoms
O  -1.021552 2.851662 0.239737
N  0.431833 0.666717 0.060767
N  -0.6528 -1.407584 -0.348105
N  -3.096786 -1.535537 -0.377417
N  -4.452816 0.298781 0.007271
N  -1.770647 -3.405973 -0.798219
N  -3.205724 2.780454 -0.494557
C  1.796391 0.279559 0.051268
C  -0.718655 -0.055729 -0.13863
C  -1.997212 0.655378 -0.133014
C  4.613853 -0.272587 0.078512
C  2.744086 1.321143 0.263252
C  2.271633 -1.044324 -0.150141
C  4.12384 1.044959 0.275226
C  3.659594 -1.298431 -0.136677
C  -3.161003 -0.186987 -0.171564
C  -1.838832 -2.064455 -0.508066
C  -2.034823 2.128009 -0.103699
C  6.102397 -0.572584 0.123533
H  0.224045 1.675721 0.247028
H  2.390275 2.348986 0.411826
H  1.546963 -1.841897 -0.313851
H  4.832556 1.866423 0.437499
H  4.008343 -2.326728 -0.297128
H  6.359798 -1.441259 -0.508442
H  6.70013 0.289361 -0.223298
H  6.434364 -0.807504 1.154243
H  -5.180179 -0.416769 0.028115
H  -4.604939 1.172884 0.510089
H  -0.860576 -3.849211 -0.886075
H  -2.632861 -3.933916 -0.900256
H  -3.915057 2.301003 -1.051454
H  -3.15464 3.799335 -0.524673
