program: Gaussian 09
title: 000259906
version: EM64L-G09RevD.01
frameworkgroup: C1[X(C15H12Br2N2O)]
method: RPBEPBE
basis: SDD
operation: Freq
keyword: #p
keyword: freq=noraman
keyword: PBEPBE/SDD
title: #p freq=noraman PBEPBE/SDD
converged: YES YES NO NO
title: Mulliken charges:
elementType: Br Br O N N C C C C C C C C C C C C C C C H H H H H H H H H H H H
charge: -0.002670 0.023328 -0.220811 -0.486110 -0.703286 -0.710105 0.404017 0.253023 0.333607 0.159074 -0.641559 -0.425265 -0.652206 -0.357140 0.714291 -0.390708 0.551157 -0.452337 0.226876 -0.775391 0.261666 0.266329 0.260441 0.236182 0.238470 0.220338 0.315759 0.310012 0.310016 0.257961 0.259299 0.215741
chargesum: 0.00000
title: Mulliken charges with hydrogens summed into heavy atoms:
elementType: Br Br O N N C C C C C C C C C C C C C C C
charge: -0.002670 0.023328 -0.220811 -0.170351 -0.083258 -0.182110 0.404017 0.253023 0.333607 0.159074 -0.641559 -0.164823 -0.416025 -0.118670 0.714291 -0.390708 0.551157 -0.231998 0.226876 -0.042389
polarizability: 3.88871254e+02 3.23482949e+00 2.34643359e+02 -6.71408023e+00 -3.85187036e+00 1.00714629e+02
1716.lowfreq: -0.0005 -0.0002 -0.0001 3.4878 6.0124 6.3660 33.8423 47.9406 62.2752
frequency: 33.8218 47.9269 62.2711 70.3561 77.3125 80.4382 94.0765 116.0012 122.7535 166.0483 211.4043 218.1445 234.1269 259.3575 266.6016 273.9836 292.5774 361.3833 379.8036 382.5203 390.0871 417.9259 432.4625 467.1778 519.9577 520.7195 530.4280 547.9041 566.7014 578.3831 599.2437 638.9360 667.2007 680.2338 709.2852 747.6457 754.0964 778.3268 790.5061 818.8987 856.4764 881.1885 909.3671 928.2108 942.2982 950.6204 969.3521 1004.4674 1018.4166 1035.8043 1036.6206 1118.8108 1136.1824 1160.5114 1173.8848 1203.2633 1214.4690 1236.8647 1269.7018 1302.6255 1326.5967 1351.7441 1381.2621 1382.6243 1405.2646 1426.6973 1442.2659 1446.1851 1459.5459 1468.3794 1471.8690 1499.3996 1552.5774 1590.5445 1604.3049 1638.9689 1642.5742 1646.5248 2986.5818 2992.6343 3030.1002 3082.1034 3119.1098 3120.6277 3121.4617 3145.4981 3166.6032 3526.2479 3564.7286 3704.9666
redmass: 5.5345 7.1480 5.8454 3.4873 4.2928 1.1411 9.2441 8.0198 19.1010 5.2913 3.2801 14.8087 6.6572 5.7391 5.1505 2.7993 5.5350 3.4082 1.3535 1.3982 2.0267 4.0033 2.7778 3.2416 1.6392 4.8183 3.6232 3.9684 3.7527 3.6493 5.0321 4.3389 6.5974 6.3288 4.2901 3.5434 5.1719 6.7587 5.8985 1.4956 1.5567 1.5531 4.3194 2.9396 1.6409 1.8236 3.0109 2.3883 3.9863 1.5591 1.6677 2.4035 1.1371 1.4294 2.6910 2.2767 1.6449 2.1682 1.7902 2.9673 2.5765 6.1843 4.3192 1.2377 3.2225 1.3361 1.5142 2.8065 1.8026 1.5144 1.7138 4.1541 8.0204 7.2287 9.0695 2.7859 3.3731 2.0670 1.0611 1.0371 1.0991 1.0987 1.0911 1.0987 1.0878 1.0969 1.0925 1.0766 1.0449 1.1040
irintensity: 1.6712 3.4689 1.6677 6.5175 0.3635 0.6793 0.3602 3.3977 0.2618 3.1689 5.4854 0.4955 2.1431 3.7606 3.0035 6.0177 2.5716 3.9220 79.7012 53.8049 177.2613 12.6173 5.8195 14.0332 53.7268 2.8299 18.2913 3.5724 5.8948 14.5111 1.0629 12.0529 60.9107 8.0392 0.0754 1.4901 4.2430 12.7926 13.9107 46.5639 31.4996 10.7861 12.4604 3.3534 6.3850 7.6950 22.5169 22.4014 29.6264 4.6724 16.5772 12.4172 0.2250 5.1474 37.2739 56.8176 6.3627 103.6362 53.5958 29.8368 137.8320 11.0346 19.4366 59.3626 49.7715 19.0593 97.4709 183.0520 179.1145 50.3043 42.6996 41.2920 56.8644 32.0909 170.5973 70.9011 194.7592 384.7291 8.5507 12.2297 4.4530 15.4471 13.7712 10.1949 27.0237 21.9465 2.7197 18.6876 140.2538 21.8187
temp: 298.150 k
press: 1.00000 atm
elementType: 35 35 8 7 7 6 6 6 6 6 6 6 6 6 6 6 6 6 6 6 1 1 1 1 1 1 1 1 1 1 1 1
symmnumber: 1
zpe: 613410.1 jmol-1
zpe.correction: 0.233636 hartree
zpe.thermalcorrener: 0.252631 hartree
zpe.thermalcorrenthalpy: 0.253575 hartree
zpe.thermalcorrgfe: 0.184396 hartree
zpe.sumelectzpe: -789.080050 hartree
zpe.sumelectthermal: -789.061055 hartree
zpe.sumelectthermalent: -789.060110 hartree
zpe.sumelectthermalfe: -789.129290 hartree
dipole: -5.4909 1.9313 -2.7826
dipole: 6.4516
quadrupole: -83.4275 -126.4944 -145.7969
quadrupole: 7.5794 -12.7135 -0.0714
quadrupole: 35.1454 -7.9215 -27.2239 7.5794 -12.7135 -0.0714
hfenergy: -789.3136859 hartree
pointgroup: C01 [X(C15H12Br2N2O1)]
dipole: 2.1311894 0.8762867 1.0643295 debye
polarizability: 387.3445698|10.7467388|234.3844201|-17.7140417|10.6259381|102.5002523 unknown
InChI: InChI=1S/C15H12Br2N2O/c1-7(20)19-15-13(16)6-11-10-3-2-9(18)4-8(10)5-12(11)14(15)17/h2-4,6,19H,5,18H2,1H3
charge 0 multiplicity 1
32 atoms
Br -1.877016 2.895682 0.63972
Br -2.914726 -2.86426 0.454844
O  -4.232878 -0.472811 -1.550969
N  -3.594968 0.255751 0.579175
N  6.159228 0.424305 -0.349234
C  1.295406 1.772913 0.267847
C  0.122301 0.806622 0.302224
C  0.584963 -0.538134 0.139006
C  2.4891 0.845208 0.065899
C  2.046202 -0.511371 -0.007014
C  -1.246307 1.043246 0.442593
C  -0.324439 -1.616608 0.148773
C  3.8453 1.172784 -0.045582
C  2.988279 -1.547621 -0.194987
C  -2.203527 -0.016755 0.442837
C  -1.695856 -1.341732 0.32025
C  4.801379 0.127466 -0.235148
C  4.354175 -1.229197 -0.30756
C  -4.540212 0.024637 -0.435283
C  -5.970771 0.391753 -0.05057
H  1.369667 2.358305 1.205135
H  1.191048 2.51001 -0.552114
H  0.016902 -2.649867 0.045474
H  4.181213 2.215706 0.009453
H  2.669958 -2.5944 -0.256667
H  5.091554 -2.027646 -0.454658
H  -3.892716 0.800981 1.391362
H  6.48976 1.383712 -0.304993
H  6.843579 -0.313197 -0.488665
H  -6.496527 -0.516377 0.29731
H  -6.495198 0.762539 -0.944856
H  -6.027576 1.152656 0.748096
